program: Gaussian 09
title: 000002789
version: EM64L-G09RevD.01
frameworkgroup: C1[X(C16H13ClN2O2)]
method: RPBEPBE
basis: SDD
operation: Freq
keyword: #p
keyword: freq=noraman
keyword: PBEPBE/SDD
title: #p freq=noraman PBEPBE/SDD
converged: YES YES NO NO
title: Mulliken charges:
elementType: Cl O O N N C C C C C C C C C C C C C C C C H H H H H H H H H H H H H
charge: -0.043215 -0.205054 -0.229938 -0.320316 -0.204305 0.278715 0.278121 -0.662177 0.154829 0.163290 0.416219 -0.275165 -0.294630 -0.638031 -0.123789 -0.265411 -0.362383 -0.334191 -0.209337 -0.221301 -0.241366 0.291706 0.271906 0.296248 0.249825 0.236002 0.232279 0.281811 0.262290 0.252679 0.268756 0.230799 0.232180 0.232951
chargesum: 0.00000
title: Mulliken charges with hydrogens summed into heavy atoms:
elementType: Cl O O N N C C C C C C C C C C C C C C C C
charge: -0.043215 -0.205054 -0.229938 -0.320316 -0.204305 0.278715 0.278121 -0.098564 0.154829 0.163290 0.416219 0.021083 -0.044805 0.112061 -0.123789 -0.003120 -0.109704 -0.065436 0.021463 0.010880 -0.008415
polarizability: 2.44334027e+02 -5.37941594e+00 2.29537756e+02 1.07482590e+01 1.55676995e+01 1.43226706e+02
1716.lowfreq: -5.0666 -0.0005 0.0003 0.0018 4.4908 10.1686 33.0493 42.8614 60.2918
frequency: 32.9913 42.8531 60.2816 66.6626 89.6625 99.9035 130.3047 163.3635 164.9693 204.4096 211.6719 252.8529 277.2847 281.8085 314.8027 352.4776 369.7899 383.5323 405.7627 424.3983 443.1309 475.6927 478.2381 510.3017 524.6109 557.8671 580.8306 608.3988 618.5025 624.8874 659.2563 671.5164 695.5899 718.2429 748.6455 762.2769 780.6528 812.0199 841.1338 877.6068 896.6793 908.4415 917.2365 943.7098 953.0627 972.1320 979.3786 989.6930 994.6772 1025.7211 1049.3062 1078.8324 1086.8612 1100.4297 1116.8616 1139.8317 1151.3356 1173.6675 1183.7208 1194.7880 1233.8385 1262.2671 1275.5001 1282.3966 1292.0819 1318.2762 1339.4654 1374.1476 1384.8719 1394.5910 1424.9024 1441.3834 1443.9880 1463.1002 1479.4662 1482.4222 1499.6730 1573.1461 1588.0962 1596.8540 1604.6094 1615.5102 1630.3069 2988.1158 3017.5895 3083.1629 3128.4372 3132.2011 3141.6062 3141.8405 3153.7880 3158.7000 3167.3236 3173.5798 3181.4255 3184.4319
redmass: 5.4441 4.5483 9.5757 6.5592 5.9012 4.2098 4.8836 1.3000 3.5129 5.0393 5.8571 5.9062 5.0196 6.6284 5.8635 4.9017 6.1381 4.3453 2.8457 6.2553 3.4095 5.7429 3.3192 4.0110 3.7219 5.5910 4.7457 6.5997 6.0540 5.7915 6.2586 5.8349 1.9457 4.3142 5.6006 2.0199 4.5365 1.4399 1.2514 1.4758 2.9783 2.8942 1.7471 1.3406 2.7345 1.3918 5.4484 5.3153 1.3860 2.2035 3.6387 1.9459 1.7470 1.7283 1.3498 1.5215 1.9789 1.0510 1.2641 1.7610 2.1051 1.9117 1.8755 4.8915 2.0652 1.3697 3.7787 8.8147 9.4396 4.1013 1.1985 2.0942 1.1409 1.0763 2.3686 2.6827 1.0762 8.7541 6.9737 6.6444 6.3659 7.3726 10.6938 1.0387 1.0661 1.0949 1.1025 1.0851 1.0891 1.0972 1.0944 1.0883 1.0991 1.0926 1.0972 1.0972
irintensity: 1.1881 0.1840 1.2257 1.8577 1.9843 2.4408 2.1748 0.8563 1.1745 1.7831 0.5964 7.2719 2.3132 2.0154 0.3500 3.5080 7.3418 0.9911 0.8635 5.3309 3.1048 21.0391 1.1568 19.5730 20.3144 3.8724 2.5564 0.5954 3.0033 3.1044 3.4179 6.9975 39.7630 5.1954 3.8249 77.4581 24.5903 39.0446 0.6536 13.4312 10.3892 1.0861 1.1015 0.5760 4.9130 0.5836 33.4360 1.3532 0.9615 7.7116 9.4681 6.6469 10.2539 21.0659 5.2856 10.6001 37.9371 0.0272 1.9695 7.5393 51.5702 30.6048 70.0166 124.5119 102.1848 7.2481 191.0480 0.9901 0.0151 20.6370 39.1523 15.1230 22.3688 14.7564 101.2206 158.4710 25.2366 11.6776 93.5608 16.1838 11.4278 181.4850 450.9159 39.8663 2.6840 19.1233 2.7580 0.9719 6.2788 0.2208 26.9192 4.0804 21.7229 0.0526 2.4700 1.9736
temp: 298.150 k
press: 1.00000 atm
elementType: 17 8 8 7 7 6 6 6 6 6 6 6 6 6 6 6 6 6 6 6 6 1 1 1 1 1 1 1 1 1 1 1 1 1
symmnumber: 1
zpe: 668883.8 jmol-1
zpe.correction: 0.254764 hartree
zpe.thermalcorrener: 0.272586 hartree
zpe.thermalcorrenthalpy: 0.273531 hartree
zpe.thermalcorrgfe: 0.208126 hartree
zpe.sumelectzpe: -1336.062530 hartree
zpe.sumelectthermal: -1336.044708 hartree
zpe.sumelectthermalent: -1336.043764 hartree
zpe.sumelectthermalfe: -1336.109169 hartree
dipole: -0.0903 4.4899 1.6825
dipole: 4.7956
quadrupole: -116.5694 -155.4645 -119.5672
quadrupole: 14.2517 2.3562 1.4922
quadrupole: 13.9643 -24.9308 10.9665 14.2517 2.3562 1.4922
hfenergy: -1336.3172945 hartree
pointgroup: C01 [X(C16H13Cl1N2O2)]
dipole: 0.1497668 -1.8344094 -0.4151201 debye
polarizability: 242.6975483|5.0905334|233.103246|-14.3498863|1.773843|141.2976946 unknown
InChI: InChI=1S/C16H13ClN2O2/c1-18-13-8-7-11(17)9-14(13)19(16(21)10-15(18)20)12-5-3-2-4-6-12/h2-9H,10H2,1H3
charge 0 multiplicity 1
34 atoms
Cl -0.095303 -4.490832 1.38198
O  -0.6990 2.879003 0.939025
O  3.056742 2.871052 -0.424949
N  -0.386485 0.622657 0.362831
N  2.411053 0.643647 -0.684277
C  0.455623 -0.544946 0.345303
C  1.791174 -0.537479 -0.169093
C  1.532316 1.927523 1.25259
C  0.055468 1.875413 0.861062
C  2.403666 1.877337 -0.003748
C  -1.771537 0.460982 -0.05868
C  -0.097517 -1.762269 0.827959
C  2.51332 -1.762295 -0.208429
C  3.283239 0.539897 -1.878331
C  0.646664 -2.946452 0.765644
C  1.955465 -2.971511 0.242566
C  -2.038817 -0.16146 -1.301973
C  -2.836916 0.911239 0.755841
C  -3.372726 -0.342405 -1.724823
C  -4.168526 0.73525 0.320132
C  -4.442886 0.105944 -0.915792
H  1.713277 2.890951 1.747376
H  1.788522 1.099247 1.93872
H  -1.114419 -1.764009 1.228489
H  3.535177 -1.763284 -0.598647
H  2.846694 -0.176156 -2.592426
H  4.310063 0.222921 -1.615406
H  3.34893 1.539921 -2.333491
H  2.524984 -3.903527 0.199473
H  -1.207478 -0.494965 -1.931899
H  -2.627455 1.408639 1.705688
H  -3.574448 -0.824068 -2.687643
H  -4.991612 1.090167 0.949523
H  -5.477951 -0.02973 -1.247294
