program: Gaussian 09
title: 000028353
version: EM64L-G09RevD.01
frameworkgroup: C1[X(C15H10I2O3)]
method: RPBEPBE
basis: SDD
operation: Freq
keyword: #p
keyword: freq=noraman
keyword: PBEPBE/SDD
title: #p freq=noraman PBEPBE/SDD
converged: YES YES NO NO
title: Mulliken charges:
elementType: I I O O O C C C C C C C C C C C C C C C H H H H H H H H H H
charge: 0.126456 0.140125 -0.381263 -0.423170 -0.222856 0.469042 0.194560 0.303885 -0.379385 -0.292115 -0.347356 -0.396184 -0.386473 -0.549991 -0.523044 0.560739 -0.233312 -0.225873 0.046604 -0.240218 0.234797 0.314211 0.252957 0.249210 0.281007 0.228948 0.229474 0.232154 0.350812 0.386260
chargesum: 0.00000
title: Mulliken charges with hydrogens summed into heavy atoms:
elementType: I I O O O C C C C C C C C C C C C C C C
charge: 0.126456 0.140125 -0.030452 -0.036910 -0.222856 0.469042 0.194560 0.303885 -0.144588 0.022096 -0.094399 -0.146974 -0.105465 -0.549991 -0.523044 0.560739 -0.004364 0.003601 0.046604 -0.008063
polarizability: 3.97005357e+02 1.40672371e+01 2.56111630e+02 -5.06220253e+00 1.52354503e+01 1.13178948e+02
1716.lowfreq: -3.1430 -0.0004 0.0004 0.0005 2.6762 3.8133 15.3999 22.2964 37.9107
frequency: 15.2746 22.2219 37.8957 56.1596 72.8917 79.7618 81.3326 106.8409 141.4978 150.3788 178.9474 191.8482 234.3471 246.8185 252.4574 270.2326 310.5947 339.6938 396.5234 408.1481 444.3759 448.2892 485.5943 493.2316 503.1659 551.5927 586.1726 598.5223 614.7657 646.9646 666.0976 683.9626 701.9036 716.9151 729.5147 759.3679 769.1293 794.1451 855.2972 867.7757 876.9038 913.0882 925.3028 939.9340 948.6164 981.0865 988.2016 1000.2561 1030.3896 1033.9972 1063.5332 1090.3419 1132.4018 1174.9055 1199.7861 1201.7163 1235.4192 1244.0089 1275.7716 1299.8196 1321.9195 1353.9014 1375.1518 1389.3846 1410.5140 1434.8778 1450.5710 1480.5436 1532.6275 1577.7803 1582.3995 1595.8066 1609.9544 1644.7855 3092.5085 3125.7080 3134.2094 3146.6941 3152.5063 3159.8942 3170.5778 3196.0773 3444.1648 3482.8215
redmass: 8.4450 8.7974 5.7972 5.7770 10.9826 8.6102 13.4093 8.5565 6.6455 10.4123 5.6709 6.8808 6.4070 7.2702 8.8849 5.8703 6.3145 7.4619 4.1274 3.0741 3.0249 1.2942 4.6318 4.5554 4.6206 4.1461 3.6278 3.5442 6.3129 1.6776 5.3322 7.9118 2.0170 3.7589 5.5017 3.1868 3.1994 4.3471 1.2651 1.4255 7.1789 1.4323 1.9693 1.5767 2.4903 1.5601 3.9346 1.3170 2.4792 3.6987 2.3920 1.6172 1.5798 1.0523 1.2897 1.7593 1.9260 2.1548 2.3253 1.8451 1.4176 2.9882 6.2912 4.2043 1.9729 2.3156 3.7706 2.2305 5.9261 5.6643 7.1337 6.7318 6.4104 8.9110 1.0868 1.0849 1.0881 1.0937 1.0926 1.0961 1.0998 1.0921 1.0649 1.0636
irintensity: 0.2793 1.4027 0.1371 0.1258 0.3975 1.6876 0.3047 0.2547 0.0914 0.1703 0.9643 2.1342 1.1051 3.2125 0.2404 5.6453 0.0924 4.3463 0.8797 0.2064 16.2335 108.3449 12.8020 35.5072 9.8157 14.9314 89.6031 24.3787 0.7488 105.1200 2.4003 38.0450 45.2088 30.5196 19.1616 0.8714 42.8673 54.1169 0.7696 6.8441 3.4016 10.6256 46.2203 29.1420 31.4335 1.3586 0.1785 0.0428 20.1947 2.9057 152.6703 9.2646 222.3318 0.0532 28.7603 17.0551 0.9580 190.4548 23.2508 8.9539 17.3627 21.1619 0.7924 4.3393 3.3205 43.4923 170.2905 38.4861 42.1139 3.1531 9.6741 21.5044 10.8837 231.4525 21.4580 3.0448 4.0833 26.0268 2.4101 17.0890 26.7527 20.4275 121.7398 28.1404
temp: 298.150 k
press: 1.00000 atm
elementType: 53 53 8 8 8 6 6 6 6 6 6 6 6 6 6 6 6 6 6 6 1 1 1 1 1 1 1 1 1 1
symmnumber: 1
zpe: 543891.2 jmol-1
zpe.correction: 0.207157 hartree
zpe.thermalcorrener: 0.226002 hartree
zpe.thermalcorrenthalpy: 0.226946 hartree
zpe.thermalcorrgfe: 0.154825 hartree
zpe.sumelectzpe: -824.869713 hartree
zpe.sumelectthermal: -824.850869 hartree
zpe.sumelectthermalent: -824.849924 hartree
zpe.sumelectthermalfe: -824.922045 hartree
dipole: -0.7699 -2.0673 -1.1815
dipole: 2.5025
quadrupole: -131.4540 -131.8895 -151.0225
quadrupole: -2.2531 5.5289 2.3750
quadrupole: 6.6680 6.2325 -12.9005 -2.2531 5.5289 2.3750
hfenergy: -825.0768705 hartree
pointgroup: C01 [X(C15H10I2O3)]
dipole: 0.4006317 -0.0822348 0.8955751 debye
polarizability: 398.0300673|-8.0122227|146.5570077|-6.976273|-61.8050208|221.7088603 unknown
InChI: InChI=1S/C15H10I2O3/c16-12-7-9(8-13(17)14(12)18)6-11(15(19)20)10-4-2-1-3-5-10/h1-8,18-19H
charge 0 multiplicity 1
30 atoms
I  -4.281559 -2.07809 2.796584
I  -4.398431 1.84192 -1.952896
O  -5.39235 -0.129045 0.341605
O  0.504782 1.682472 -2.136034
O  1.518642 -0.26951 -2.849923
C  -1.13003 -0.050879 0.381643
C  1.348512 0.16043 -0.441181
C  2.780176 0.041778 -0.0171
C  0.340029 -0.082653 0.466278
C  -1.892605 0.713501 -0.55008
C  -1.841915 -0.829726 1.341605
C  3.161992 0.485866 1.282448
C  3.784516 -0.498993 -0.869309
C  -3.2437 -0.870629 1.336818
C  -3.294719 0.668066 -0.541698
C  -4.009634 -0.129803 0.393566
C  4.49544 0.367009 1.725753
C  5.11823 -0.612359 -0.422055
C  1.136334 0.44962 -1.898418
C  5.481777 -0.185843 0.876069
H  0.700006 -0.448635 1.439194
H  -1.375665 1.370174 -1.250271
H  -1.28296 -1.414744 2.078318
H  2.417679 0.961541 1.931037
H  3.511652 -0.852913 -1.867861
H  4.767593 0.722587 2.725782
H  5.873887 -1.041903 -1.089138
H  6.519142 -0.273077 1.217318
H  -5.774552 -0.718093 1.048957
H  0.441531 1.825132 -3.121713
