program: Gaussian 09
title: 000028308
version: EM64L-G09RevD.01
frameworkgroup: C1[X(C14H9Cl)]
method: RPBEPBE
basis: SDD
operation: Freq
keyword: #pfreq=noraman
keyword: PBEPBE/SDD
title: #p freq=noraman PBEPBE/SDD
converged: NO NO NO YES
title: Mulliken charges:
elementType: Cl C C C C C C C C C C C C C C H H H H H H H H H
charge: -0.060684 0.406518 0.412831 0.399987 0.400700 -0.653584 -0.650963 -0.391556 -0.407904 -0.417770 -0.417139 -0.114867 -0.232408 -0.239758 -0.240045 0.247089 0.247255 0.265680 0.246014 0.242209 0.241609 0.256767 0.230046 0.229972
chargesum: 0.00000
title: Mulliken charges with hydrogens summed into heavy atoms:
elementType: Cl C C C C C C C C C C C C C C
charge: -0.060684 0.406518 0.412831 0.399987 0.400700 -0.406494 -0.403708 -0.125876 -0.161890 -0.175561 -0.175531 -0.114867 0.024360 -0.009711 -0.010073
polarizability: 3.19739874e+02 -8.31870460e+00 1.58224851e+02 9.08721855e-04 8.70574615e-04 5.88841677e+01
1716.lowfreq: -6.9026 -4.3374 0.0008 0.0018 0.0021 9.3007 62.1505 111.7866 153.9859
frequency: 62.1497 111.7864 153.9858 168.5587 252.2128 270.3701 312.9285 318.4236 385.5275 405.7881 454.3174 470.1322 474.7417 527.3141 544.0877 600.3706 614.9434 631.7264 690.2109 745.2131 747.2701 754.2464 787.7831 809.9703 812.9069 850.5950 871.9323 897.6182 911.2345 916.3800 934.7553 965.0424 972.6701 992.0313 1013.9282 1060.3088 1109.4314 1150.7833 1172.7777 1185.8299 1196.6643 1265.8794 1272.7471 1282.9744 1290.5655 1350.1161 1395.9521 1425.4726 1430.7381 1435.0449 1446.8564 1479.2512 1549.2095 1563.4114 1578.8188 1626.4978 1637.5730 3117.6846 3120.2235 3121.4875 3125.4170 3132.2609 3143.3113 3152.6806 3162.2278 3172.1312
redmass: 7.2704 4.1564 8.5378 5.4491 4.3116 6.9486 4.7692 8.0901 3.2196 4.7517 6.8085 2.6563 2.5221 3.8412 6.9237 3.5728 6.7526 7.1414 6.9041 5.7447 3.0814 1.2550 2.0940 1.4903 3.6454 1.3001 1.5304 5.6687 1.4834 5.8249 1.9853 1.3746 1.4194 1.3481 2.3276 2.3940 2.0060 1.3269 1.0839 1.4513 1.2192 1.5536 2.8796 1.6668 2.3686 1.8398 4.0403 3.0546 3.5618 8.0332 2.7753 2.9345 5.8155 7.7003 5.7114 6.7333 6.7006 1.0907 1.0866 1.0914 1.0887 1.0893 1.0952 1.0927 1.1003 1.0962
irintensity: 0.0812 0.8948 0.0765 0.3347 0.0056 1.6100 0.5731 4.3821 1.1216 0.7317 7.2114 14.3548 18.1112 1.2407 10.1129 4.6998 0.9377 0.7214 21.0654 0.0889 1.3108 76.0928 0.8021 8.4228 1.1268 0.0166 2.7839 13.3693 87.5497 45.7791 4.6851 0.0560 17.8866 0.0000 4.2952 39.5536 0.5222 12.9494 0.6509 11.4233 0.0119 7.1330 8.3701 0.0853 2.3119 0.8025 3.3875 4.0410 4.4222 0.0628 36.0797 5.1562 12.9925 1.3418 22.4427 35.6190 3.2208 8.0750 7.0089 3.7862 0.2425 8.1398 32.6929 3.0899 42.0373 6.4442
temp: 298.150 k
press: 1.00000 atm
elementType: 17 6 6 6 6 6 6 6 6 6 6 6 6 6 6 1 1 1 1 1 1 1 1 1
symmnumber: 1
zpe: 476038.8 jmol-1
zpe.correction: 0.181314 hartree
zpe.thermalcorrener: 0.192250 hartree
zpe.thermalcorrenthalpy: 0.193194 hartree
zpe.thermalcorrgfe: 0.144163 hartree
zpe.sumelectzpe: -997.966816 hartree
zpe.sumelectthermal: -997.955880 hartree
zpe.sumelectthermalent: -997.954936 hartree
zpe.sumelectthermalfe: -998.003967 hartree
dipole: 2.4227 0.7501 0.0000
dipole: 2.5362
quadrupole: -91.7288 -79.5369 -100.2548
quadrupole: -3.4234 0.0000 0.0002
quadrupole: -1.2220 10.9699 -9.7479 -3.4234 0.0000 0.0002
hfenergy: -998.1481299 hartree
pointgroup: C01 [X(C14H9Cl1)]
dipole: -0.9359056 -0.3459945 0.0000038 debye
dipolederiv: -0.9626214 -0.1967221 0.0000056 -0.3897882 -0.2233589 0.0000032 0.0000081 0.0000021 -0.071536 0.2448818 0.0352253 0.0000003 0.0179177 -0.0710766 0.0000012 -0.0000019 0.0000017 0.0331541 -0.0101451 -0.039452 0.0000016 0.0619052 -0.1278967 0.0000022 -0.000003 0.000002 0.0303649 0.1454986 -0.0312352 -0.0000004 -0.0120672 -0.1018443 0.0000022 -0.0000012 0.0000006 0.0420635 0.060715 0.0140229 -0.0000008 -0.0048609 -0.1312803 0.0000015 -0.0000008 0.0000024 0.0394819 -0.1750314 -0.005479 0.0000009 0.0017823 0.1438604 -0.0000024 0.0000006 0.0000009 -0.1876498 -0.0180191 0.0120561 0.0000002 0.0292927 0.1594643 -0.0000031 0.0000009 -0.0000055 -0.1825396 -0.4005566 -0.0623712 0.0000014 0.0072851 -0.0237002 -0.0000046 0.0000029 -0.000009 -0.1274049 0.1595323 0.0366688 -0.0000013 -0.1579529 0.1144148 -0.0000039 0.0000017 -0.0000035 -0.1533472 -0.0692733 0.0081584 -0.0000015 -0.0994453 0.118963 -0.0000043 -0.0000001 -0.0000062 -0.1712016 0.0036701 0.0002476 -0.0000013 0.1294944 0.1093654 -0.0000026 -0.0000031 -0.0000013 -0.1708327 1.2770802 0.4011409 -0.0000105 0.5588712 0.335768 -0.0000058 -0.0000144 -0.0000037 -0.0706517 -0.377941 -0.1979315 0.0000033 -0.1643828 -0.0242456 0. 0.000007 -0.0000002 -0.1226316 -0.0334113 -0.1305222 0.0000007 -0.0980474 0.0806486 -0.0000018 0.000003 -0.0000007 -0.1597308 -0.0200939 0.1470055 -0.0000022 0.1157394 0.0201437 -0.0000019 -0.0000004 -0.0000029 -0.1616929 0.0574576 -0.0125063 0.0000001 -0.0113553 -0.0852699 0.000002 -0.0000005 0.0000003 0.1535483 0.0567628 -0.0111899 0.0000002 -0.015653 -0.0896005 0.0000022 -0.0000002 0.0000033 0.1534075 0.0809267 0.0204098 -0.0000002 -0.0446731 -0.0354583 0.0000039 0.0000019 0.0000067 0.165677 0.0559082 -0.0597123 0.0000009 0.0252574 -0.0884717 0.0000029 0.0000001 0.000003 0.1552784 0.0725658 -0.0569232 0.0000014 0.0388533 -0.1011543 0.0000033 0.0000004 0.0000048 0.1571364 0.0705714 0.0289525 0.0000003 -0.0688728 -0.1029798 0.0000023 0.0000014 0.0000016 0.1567759 -0.0175577 0.0804173 -0.0000006 0.0580306 0.0555132 0.0000011 -0.0000024 0.0000013 0.1677993 -0.0846937 0.1050835 0. 0.11111 0.0184229 0.0000008 -0.0000014 0.0000015 0.1619555 -0.1162259 -0.0853437 0.0000019 -0.0884406 0.0497727 0.0000015 0.0000014 0.0000009 0.1625761 unknown
polarizability: 320.1661632|0.4087341|157.7985619|-0.0008606|-0.0009182|58.8841677 unknown
InChI: InChI=1S/C14H9Cl/c15-14-6-5-12-7-10-3-1-2-4-11(10)8-13(12)9-14/h1-9H
charge 0 multiplicity 1
24 atoms
Cl 5.034155 1.072496 -0.000042
C  0.937375 0.55106 -0.000021
C  0.817125 -0.905927 -0.000006
C  -1.526994 0.753311 -0.000024
C  -1.647482 -0.703613 -0.000009
C  -0.237986 1.341572 -0.000032
C  -0.470902 -1.493019 -0.000004
C  2.251315 1.145095 -0.000025
C  2.022013 -1.697846 -0.000001
C  -2.730806 1.547103 -0.00002
C  -2.964416 -1.29026 0.000007
C  3.369447 0.328041 -0.000025
C  3.278819 -1.10357 -0.000011
C  -3.984367 0.944053 -0.000006
C  -4.102804 -0.490802 0.000007
H  -0.148922 2.435236 -0.000039
H  -0.560669 -2.586844 0.000007
H  2.352343 2.235244 -0.000048
H  1.938308 -2.790859 0.000012
H  -2.639876 2.640004 -0.000036
H  -3.05299 -2.383426 0.000016
H  4.192636 -1.704519 -0.000005
H  -4.891531 1.558374 -0.000009
H  -5.098291 -0.948205 0.000015
