program: Gaussian 09
title: 000028329
version: EM64L-G09RevD.01
frameworkgroup: C1[X(C13H21N5O2)]
method: RPBEPBE
basis: SDD
operation: Freq
keyword: #p
keyword: freq=noraman
keyword: PBEPBE/SDD
title: #p freq=noraman PBEPBE/SDD
converged: YES YES NO NO
title: Mulliken charges:
elementType: O O N N N N N C C C C C C C C C C C C C H H H H H H H H H H H H H H H H H H H H H
charge: -0.287716 -0.268645 -0.142950 -0.103904 -0.148120 -0.225944 -0.093654 -0.396013 -0.374221 0.142786 0.063901 -0.349294 -0.331421 -0.212364 0.192388 0.209955 -0.669544 -0.672759 -0.610675 -0.601743 0.259816 0.230282 0.211651 0.242259 0.193031 0.256135 0.191421 0.210752 0.268626 0.222704 0.203938 0.210830 0.227990 0.204421 0.210970 0.270269 0.248330 0.247490 0.266663 0.251275 0.251087
chargesum: 0.00000
title: Mulliken charges with hydrogens summed into heavy atoms:
elementType: O O N N N N N C C C C C C C C C C C C C
charge: -0.287716 -0.268645 -0.142950 -0.103904 -0.148120 -0.225944 -0.093654 0.094084 0.079689 0.142786 0.063901 0.099871 0.070752 0.056263 0.192388 0.209955 -0.032074 -0.029379 0.155415 0.167282
polarizability: 2.40367051e+02 6.83976445e-01 2.01273227e+02 1.18692114e+01 4.01624930e+00 1.18161195e+02
1716.lowfreq: -6.1097 -0.0006 0.0006 0.0007 4.3449 8.9990 21.9898 33.9598 36.6782
frequency: 21.1225 33.9456 36.6405 68.3470 73.8700 84.1919 89.2489 95.6510 112.5268 122.1734 144.2495 159.0710 164.6962 206.8888 214.7369 241.6277 269.8469 289.7496 292.6192 294.9480 321.0464 347.8799 370.7208 379.9344 401.1703 407.3519 432.1056 446.2736 470.6674 493.2706 539.7811 613.6884 639.3500 669.0791 704.3412 722.0706 744.5771 760.4368 777.3824 784.2762 795.5307 803.4080 811.7353 909.5256 915.2932 958.2405 991.5791 1008.5863 1037.9624 1047.4407 1049.9435 1073.1861 1079.3663 1084.5032 1109.1604 1129.9784 1132.0774 1146.3072 1165.9665 1190.1466 1208.5595 1219.4524 1225.9840 1242.0678 1265.1751 1279.3094 1293.3344 1298.2765 1302.5033 1320.6049 1344.7815 1362.7659 1369.3940 1376.4359 1382.4314 1386.7683 1390.2485 1410.8036 1423.7071 1427.1474 1455.1394 1462.0877 1464.4206 1472.8284 1473.8220 1475.3846 1478.3890 1479.1968 1480.6511 1483.1045 1489.0500 1495.4166 1503.8745 1569.2438 1611.8050 1643.9866 2859.3743 2876.3579 2919.8291 2981.3192 2981.6661 3008.5015 3013.4138 3032.6341 3035.4115 3040.1075 3041.3178 3073.2452 3075.0596 3088.6934 3090.4762 3098.1054 3105.1138 3111.5784 3140.2985 3140.6434 3239.7201
redmass: 3.5560 4.3039 4.4607 2.7768 2.6768 2.2397 1.1171 3.0387 4.5900 1.1152 2.4447 3.1425 2.6771 1.6458 1.7306 2.0427 2.4662 2.4975 3.3676 3.1774 3.2502 3.4637 4.8040 5.8086 5.2295 3.7428 7.4975 2.7963 3.6181 4.1715 5.7675 4.4194 5.8961 8.7167 10.7970 3.7229 9.2225 2.8649 1.4386 2.3311 1.1438 1.3969 1.6074 3.3969 2.1381 6.1758 2.2412 2.9496 3.7151 1.8702 3.1365 2.6877 1.9110 2.1185 1.8768 1.3015 1.3017 1.7244 2.0311 3.9021 2.2921 2.3423 2.6675 2.1535 4.8825 1.1776 1.2302 4.5991 1.4402 1.4226 2.4726 1.3203 3.0731 1.4322 1.2644 1.2435 1.2922 1.6052 1.5151 1.3421 1.4246 1.0644 1.0831 1.0722 1.0754 1.1729 1.0446 1.0794 1.0445 1.0690 1.0735 1.0992 2.4958 8.1632 10.8168 9.9207 1.0721 1.0714 1.0684 1.0357 1.0356 1.0335 1.0328 1.0876 1.0896 1.0797 1.0713 1.0983 1.0980 1.1003 1.1004 1.1025 1.1021 1.1064 1.1024 1.1013 1.0987
irintensity: 0.2015 0.3603 0.6023 0.1152 0.1173 0.0898 0.0607 0.3472 4.1785 0.0285 7.6782 0.6595 5.2524 2.4800 3.9442 1.2237 0.9806 3.4268 0.7126 1.7862 2.0777 7.9001 3.9353 22.2150 10.9228 2.6712 13.9745 1.2050 16.6678 10.3323 0.3912 17.1992 4.5644 0.0764 10.7102 16.8707 6.0063 6.7041 4.0964 4.9232 4.5991 10.9204 14.0640 2.6851 3.3668 31.5854 3.1556 66.4404 9.4322 9.4861 11.7306 29.1858 25.7550 3.4280 28.4145 0.3479 0.1209 14.0474 54.2945 15.4005 40.6320 73.2886 8.8497 11.2051 31.4990 13.2085 13.1179 11.3286 43.9456 3.3858 32.7823 3.8827 7.9343 16.0002 1.8971 25.6776 18.9246 31.9162 69.8642 86.9470 115.1741 5.2652 6.8477 5.7466 13.6353 20.4432 17.6270 2.1738 4.5081 11.9527 15.6409 0.8800 148.2331 6.8328 715.3550 340.6938 73.6407 108.5645 67.8630 39.5175 24.2965 36.8171 26.4745 3.0642 11.5265 17.4952 23.2804 35.0407 80.6111 39.4973 42.1198 17.2541 16.6905 7.1645 0.8253 0.5074 1.5080
temp: 298.150 k
press: 1.00000 atm
elementType: 8 8 7 7 7 7 7 6 6 6 6 6 6 6 6 6 6 6 6 6 1 1 1 1 1 1 1 1 1 1 1 1 1 1 1 1 1 1 1 1 1
symmnumber: 1
zpe: 891232.9 jmol-1
zpe.correction: 0.339453 hartree
zpe.thermalcorrener: 0.360682 hartree
zpe.thermalcorrenthalpy: 0.361627 hartree
zpe.thermalcorrgfe: 0.287883 hartree
zpe.sumelectzpe: -930.676582 hartree
zpe.sumelectthermal: -930.655352 hartree
zpe.sumelectthermalent: -930.654408 hartree
zpe.sumelectthermalfe: -930.728152 hartree
dipole: -3.1123 -1.7152 0.2061
dipole: 3.5596
quadrupole: -126.4160 -120.1401 -119.4691
quadrupole: -0.8472 -4.2594 0.5801
quadrupole: -4.4076 1.8683 2.5393 -0.8472 -4.2594 0.5801
hfenergy: -931.0160346 hartree
pointgroup: C01 [X(C13H21N5O2)]
dipole: 1.2111279 -0.6783964 -0.1850995 debye
polarizability: 240.885994|-2.2776962|201.2659781|8.2864146|4.5324125|117.6495019 unknown
InChI: InChI=1S/C13H21N5O2/c1-5-17(6-2)7-8-18-9-14-11-10(18)12(19)16(4)13(20)15(11)3/h9H,5-8H2,1-4H3
charge 0 multiplicity 1
41 atoms
O  0.020779 1.89024 0.52219
O  -4.571318 1.277409 -0.360442
N  0.200231 -1.234364 0.506155
N  3.657436 0.106721 -0.291882
N  -3.255597 -0.654569 -0.148187
N  -2.283209 1.547603 0.076108
N  -1.65611 -2.524953 0.130948
C  1.613665 -0.852483 0.717733
C  2.317269 -0.434561 -0.59959
C  -0.875585 -0.353927 0.300533
C  -1.992808 -1.179326 0.080522
C  3.63174 1.567061 0.015569
C  4.707817 -0.277084 -1.270536
C  -0.318904 -2.511653 0.387607
C  -0.944295 1.084438 0.321904
C  -3.442229 0.747223 -0.157538
C  4.745468 1.989776 0.991584
C  5.133106 -1.752929 -1.149741
C  -4.407084 -1.5490 -0.378742
C  -2.51651 3.010536 0.063446
H  1.639948 -0.008066 1.424795
H  2.144278 -1.707129 1.170237
H  2.411229 -1.319309 -1.25531
H  1.674271 0.304362 -1.130339
H  3.701153 2.170636 -0.923263
H  2.64747 1.806111 0.458389
H  4.389509 -0.059187 -2.32143
H  5.589893 0.359166 -1.074674
H  0.29303 -3.403615 0.499494
H  4.648854 1.438366 1.943254
H  5.753089 1.788035 0.583866
H  4.680282 3.073538 1.202559
H  5.515546 -1.956497 -0.134337
H  4.290102 -2.442204 -1.342117
H  5.927544 -1.987901 -1.882433
H  -5.292931 -0.916765 -0.535155
H  -4.555176 -2.206264 0.494253
H  -4.22447 -2.178099 -1.26585
H  -1.546532 3.498383 0.23714
H  -3.234904 3.285918 0.852783
H  -2.938051 3.316262 -0.907805
