program: Gaussian 09
title: 000028291
version: EM64L-G09RevD.01
frameworkgroup: C1[X(C9H16Br2O4)]
method: RPBEPBE
basis: SDD
operation: Freq
keyword: #p
keyword: freq=noraman
keyword: PBEPBE/SDD
title: #p freq=noraman PBEPBE/SDD
converged: NO YES NO NO
title: Mulliken charges:
elementType: Br Br O O O O C C C C C C C C C H H H H H H H H H H H H H H H H
charge: -0.034923 -0.034831 -0.469512 -0.469462 -0.471235 -0.471325 0.236251 0.148188 0.148372 -0.095018 -0.095496 -0.774223 -0.773500 -0.729802 -0.730091 0.246879 0.247402 0.227623 0.245292 0.224150 0.224062 0.227551 0.245019 0.376954 0.376859 0.330564 0.296856 0.330937 0.296698 0.359865 0.359893
chargesum: 0.00000
title: Mulliken charges with hydrogens summed into heavy atoms:
elementType: Br Br O O O O C C C C C C C C C
charge: -0.034923 -0.034831 -0.092557 -0.092603 -0.111370 -0.111431 0.236251 0.148188 0.148372 0.151862 0.151907 -0.077157 -0.076868 -0.102381 -0.102456
polarizability: 1.88499820e+02 -2.30987369e-02 1.43864083e+02 -1.69236753e+00 3.37459627e-03 1.07727191e+02
1716.lowfreq: -10.5121 -7.6476 -0.0005 -0.0002 0.0003 5.9638 30.0776 49.3302 52.6059
frequency: 30.0720 49.3269 52.5141 73.5403 93.4937 100.1881 151.0581 152.7506 163.6035 171.7721 199.1587 205.9535 216.9495 239.7086 250.2229 261.9030 306.0533 307.2540 323.9918 388.6221 389.9018 407.3207 415.5333 475.3837 486.5240 497.8223 522.8636 537.3353 551.6802 580.2640 595.0276 686.3811 756.0325 787.5463 788.8530 837.3502 843.0706 940.9062 962.7650 964.0280 965.8495 987.4901 989.3647 1062.4113 1063.2917 1086.2221 1116.4533 1119.0866 1123.9844 1143.5875 1165.2946 1205.3318 1218.9087 1219.1866 1244.0987 1247.9459 1267.2010 1312.0025 1322.1620 1326.2799 1343.6469 1344.2738 1381.9404 1394.3313 1427.5305 1432.4219 1460.8127 1463.8578 1482.3029 1494.4842 1494.6091 2976.5266 2979.5252 3052.0747 3053.1013 3062.9405 3064.5197 3066.3231 3068.8066 3088.0325 3089.7260 3164.7004 3165.5765 3473.1768 3475.1728 3519.2027 3520.1928
redmass: 18.1548 7.3971 6.2177 5.1448 2.9146 3.2663 4.6236 4.2794 2.3074 2.7370 2.7178 1.4217 4.1863 2.5010 2.8408 4.1602 4.3099 3.5246 5.2921 1.3595 2.4978 1.2010 1.9737 2.6243 2.9425 3.0055 1.9717 1.6207 1.5875 5.1846 4.2350 3.7781 3.8523 4.4704 4.4232 2.8202 2.4843 2.5204 1.8232 1.9617 1.3189 1.3376 2.3333 3.9588 4.0201 3.8600 1.5361 1.7503 1.6339 1.3554 1.6910 1.2004 1.1815 1.1766 1.6255 4.4358 2.2731 1.2841 1.2036 1.2281 1.5288 1.5391 1.2324 1.2071 1.1111 1.1166 1.3308 1.0487 1.3797 1.2221 1.1539 1.0362 1.0362 1.0849 1.0848 1.0993 1.0954 1.0600 1.0568 1.0987 1.0984 1.1113 1.1113 1.0641 1.0641 1.0656 1.0657
irintensity: 0.0684 0.0612 0.3212 3.1172 1.9488 0.2227 1.7433 5.3152 1.8023 3.5241 4.4099 0.3028 8.7125 5.6735 7.7029 4.4223 23.7622 0.0562 2.0677 38.0134 14.8743 187.9527 19.3805 20.8926 9.1064 3.9908 26.5135 169.5844 287.9394 43.8723 0.3467 81.6278 3.3423 7.5831 2.3112 8.6360 12.2441 86.3863 4.0819 10.0359 2.2512 0.2270 29.7204 0.4931 5.6339 189.7351 3.4324 18.6268 49.9030 18.1071 9.9306 20.2952 14.0979 46.4428 47.6135 26.0104 0.0017 111.9725 0.5535 63.8447 11.2830 18.1865 23.2437 6.1867 2.7982 22.3255 5.6313 10.0050 3.0561 9.0057 13.4681 21.8525 52.0214 12.8593 13.2888 4.4327 37.7788 12.9803 6.9387 15.7580 16.5695 0.7583 1.6172 45.4250 55.6223 24.8378 24.6164
temp: 298.150 k
press: 1.00000 atm
elementType: 35 35 8 8 8 8 6 6 6 6 6 6 6 6 6 1 1 1 1 1 1 1 1 1 1 1 1 1 1 1 1
symmnumber: 1
zpe: 636955.8 jmol-1
zpe.correction: 0.242604 hartree
zpe.thermalcorrener: 0.261088 hartree
zpe.thermalcorrenthalpy: 0.262032 hartree
zpe.thermalcorrgfe: 0.194619 hartree
zpe.sumelectzpe: -679.114055 hartree
zpe.sumelectthermal: -679.095570 hartree
zpe.sumelectthermalent: -679.094626 hartree
zpe.sumelectthermalfe: -679.162040 hartree
dipole: 0.0004 1.4044 0.0024
dipole: 1.4044
quadrupole: -114.4186 -110.6668 -109.6462
quadrupole: -0.0190 4.8396 -0.0194
quadrupole: -2.8414 0.9104 1.9310 -0.0190 4.8396 -0.0194
hfenergy: -679.3566583 hartree
pointgroup: C01 [X(C9H16Br2O4)]
dipole: -0.0031899 0.5524969 -0.0035661 debye
polarizability: 186.8009833|0.1519631|143.8621183|-11.7099034|-0.3476133|109.4279921 unknown
InChI: InChI=1S/C9H16Br2O4/c1-7(2)8(14,5(12)3-10)9(7,15)6(13)4-11/h5-6,12-15H,3-4H2,1-2H3
charge 0 multiplicity 1
31 atoms
Br -3.867457 -2.277291 0.804134
Br 3.848264 -2.241381 -0.676646
O  -0.351604 -0.118312 -1.759245
O  0.304701 -0.081674 1.852311
O  -2.89397 0.222812 -1.066966
O  2.843563 0.276643 1.156671
C  -0.034328 1.726394 0.03018
C  -0.627362 0.349141 -0.418788
C  0.575479 0.365765 0.504045
C  -2.004962 -0.115286 0.063278
C  1.959774 -0.089859 0.030653
C  0.703072 2.550886 -1.021168
C  -0.781002 2.561035 1.066931
C  -1.985095 -1.617455 0.361568
C  1.95819 -1.596726 -0.244101
H  -2.309368 0.433379 0.970729
H  2.259058 0.449992 -0.883639
H  1.607145 3.020579 -0.5906
H  0.994711 1.944503 -1.89526
H  0.043081 3.359441 -1.386748
H  -0.127953 3.379777 1.42229
H  -1.68713 3.017493 0.626621
H  -1.070882 1.966074 1.949358
H  -1.186226 0.052995 -2.276787
H  1.13728 0.107187 2.366692
H  -1.384284 -1.829948 1.25659
H  -1.672744 -2.217863 -0.505544
H  1.359938 -1.83126 -1.135202
H  1.653517 -2.186131 0.633225
H  -3.768645 -0.225119 -0.92406
H  3.722241 -0.166392 1.023978
