program: Gaussian 09
title: 000002912
version: EM64L-G09RevD.01
frameworkgroup: C1[X(C22H19Cl2NO3)]
method: RPBEPBE
basis: SDD
operation: Freq
keyword: #p
keyword: freq=noraman
keyword: PBEPBE/SDD
title: #p freq=noraman PBEPBE/SDD
converged: YES YES NO NO
title: Mulliken charges:
elementType: Cl Cl O O O N C C C C C C C C C C C C C C C C C C C C C C H H H H H H H H H H H H H H H H H H H
charge: 0.027113 -0.003762 -0.290008 -0.247177 -0.310266 0.010944 0.315091 -0.263412 -0.373027 -0.731443 -0.723992 0.138380 0.279059 -0.447119 -0.185742 0.549695 -0.201553 -0.523763 -0.446394 0.347517 -0.194399 -0.388805 0.343287 -0.354924 -0.381380 -0.205193 -0.192719 -0.249600 0.285212 0.268498 0.216773 0.220155 0.260862 0.228726 0.232313 0.209857 0.229553 0.286431 0.285035 0.262907 0.235477 0.264169 0.265931 0.258408 0.230149 0.231460 0.231673
chargesum: 0.00000
title: Mulliken charges with hydrogens summed into heavy atoms:
elementType: Cl Cl O O O N C C C C C C C C C C C C C C C C C C C C C C
charge: 0.027113 -0.003762 -0.290008 -0.247177 -0.310266 0.010944 0.315091 0.021800 -0.104530 -0.033653 -0.053095 0.367934 0.279059 -0.447119 0.100689 0.549695 -0.201553 -0.238727 -0.183486 0.347517 0.041079 -0.124636 0.343287 -0.088993 -0.122972 0.024956 0.038741 -0.017927
polarizability: 2.93296654e+02 1.97162302e+01 2.79695814e+02 1.04035517e+01 2.12394248e+01 2.50084749e+02
1716.lowfreq: -2.0335 0.0017 0.0020 0.0020 2.6909 5.8486 10.4029 18.8897 22.5754
frequency: 10.1671 18.7584 22.5426 22.6141 31.0711 38.0043 52.8001 58.3365 63.8248 76.8945 89.2207 99.2617 125.6865 148.8070 158.6181 187.9577 191.5543 206.8716 214.9781 219.6828 224.2490 249.5589 284.2501 291.5409 301.5170 322.4452 327.7879 344.2666 373.0704 379.9962 405.4530 411.3536 420.2457 437.8074 454.1890 474.2139 479.5586 496.1595 535.7563 561.9167 576.1119 594.4386 607.9598 614.3826 624.0287 639.0540 672.9085 692.0155 699.9605 714.8075 729.6886 764.9716 775.1214 797.8621 815.2654 826.2001 835.8526 842.6721 857.2931 891.6809 900.0595 912.7407 914.8686 921.4533 956.0838 957.9999 969.5057 978.5136 983.6053 987.1618 987.7516 988.6338 997.5911 1005.2843 1020.1388 1046.0639 1078.0151 1085.2804 1088.0226 1117.2703 1133.8427 1142.0355 1168.3364 1174.0766 1177.6207 1193.9705 1200.6043 1224.4369 1237.4220 1264.8276 1275.6200 1281.5131 1286.0555 1308.7546 1329.0655 1337.5636 1381.7032 1390.0748 1393.3177 1396.4942 1410.8018 1440.4472 1446.6497 1463.4191 1470.4950 1470.8235 1479.0947 1484.6566 1489.5823 1594.7487 1595.6320 1605.8478 1613.7197 1623.9499 1643.6196 2204.3777 2981.2621 2984.6212 3019.9144 3066.1143 3074.8049 3081.5432 3113.4128 3131.1777 3131.8695 3141.4871 3142.0381 3143.9322 3150.9899 3151.6547 3156.1098 3159.0159 3164.8570 3175.7069 3176.3347
redmass: 8.2252 6.2381 10.0865 8.9170 5.8133 5.0130 6.7282 6.6956 6.9233 6.8556 7.1356 7.0145 3.7367 2.8449 2.2845 1.9306 5.6463 2.7975 5.7392 2.2396 2.4988 6.0531 3.4531 4.7356 5.6742 7.0022 7.7532 4.3564 3.0066 5.2540 4.6154 2.9353 7.1504 4.3321 3.5502 4.2580 3.3899 3.5060 7.1006 7.7286 5.5233 6.0701 5.7631 5.7479 5.6742 6.2987 5.3251 2.2666 2.3017 4.9663 3.9587 1.7430 6.1910 2.2099 2.6743 4.4811 1.3003 1.9203 3.5564 4.6818 1.5008 1.4991 1.5717 2.6565 2.8724 1.6152 1.3693 1.4385 1.5176 5.2934 3.6156 1.3751 3.5439 1.3964 2.0952 1.5532 1.5106 1.3880 1.6077 2.1483 3.1820 1.9742 1.1672 1.1717 1.1365 2.2131 2.8406 1.7225 2.4653 1.4818 1.4109 1.6263 1.5002 1.3473 1.4802 1.6129 8.1168 1.2567 7.6177 1.9424 1.4452 2.3372 2.5626 1.0508 1.0567 2.2358 2.5388 1.1067 1.0569 6.2501 6.5668 6.5262 6.4967 10.4178 8.9143 12.5919 1.0365 1.0378 1.0827 1.0990 1.0989 1.0992 1.0974 1.0896 1.0852 1.0889 1.0874 1.0901 1.0922 1.0863 1.0932 1.0935 1.0967 1.1002 1.0986
irintensity: 0.5513 0.0785 0.1464 0.3944 0.9061 0.5395 1.7869 0.8733 1.4927 1.2806 1.2293 1.6472 0.4495 0.9233 0.4495 0.6626 2.2519 2.7233 0.6034 0.5114 2.0301 7.9415 1.3958 1.9111 1.0011 1.2076 2.1189 3.4617 3.4889 3.1414 3.6060 0.6784 8.1499 3.0361 8.5131 15.5369 20.8536 3.4420 10.9260 0.5029 2.4805 18.4048 13.4414 2.0904 2.8480 11.7697 2.7435 43.0189 28.3845 4.9702 2.8123 87.4633 41.7403 14.0958 68.9348 72.5541 3.5251 9.5161 223.8557 41.8923 6.6373 11.0172 4.1303 46.9256 31.3771 7.3212 0.3574 63.9334 1.8422 3.0886 0.9292 0.7531 38.1758 3.5085 13.4195 43.4800 12.2807 8.8879 8.8529 113.9972 35.8793 4.0781 30.6550 44.5778 1.8973 97.7237 225.0182 66.2408 152.3231 36.9798 27.5850 64.8226 46.5844 1.2814 12.0008 2.3332 5.6651 23.9732 11.4272 34.7230 3.0332 15.5711 54.0905 4.7568 14.8149 135.7106 21.1960 5.7034 14.1126 24.4725 111.7508 30.4838 15.0816 267.3457 15.7331 1.0633 19.4268 43.0081 20.7127 11.5991 29.4242 31.2360 11.1051 6.2300 1.7931 10.4836 6.0658 2.5160 4.7018 3.5522 21.5183 6.0782 14.1362 9.4652 6.5955
temp: 298.150 k
press: 1.00000 atm
elementType: 17 17 8 8 8 7 6 6 6 6 6 6 6 6 6 6 6 6 6 6 6 6 6 6 6 6 6 6 1 1 1 1 1 1 1 1 1 1 1 1 1 1 1 1 1 1 1
symmnumber: 1
zpe: 919709.1 jmol-1
zpe.correction: 0.350299 hartree
zpe.thermalcorrener: 0.377827 hartree
zpe.thermalcorrenthalpy: 0.378771 hartree
zpe.thermalcorrgfe: 0.287152 hartree
zpe.sumelectzpe: -2048.208231 hartree
zpe.sumelectthermal: -2048.180703 hartree
zpe.sumelectthermalent: -2048.179759 hartree
zpe.sumelectthermalfe: -2048.271378 hartree
dipole: -2.6787 0.7511 -0.4610
dipole: 2.8200
quadrupole: -159.5841 -187.7176 -178.2245
quadrupole: 6.4423 -8.0210 13.8184
quadrupole: 15.5913 -12.5422 -3.0491 6.4423 -8.0210 13.8184
hfenergy: -2048.5585297 hartree
pointgroup: C01 [X(C22H19Cl2N1O3)]
dipole: 0.9076184 -0.3487152 0.5343422 debye
polarizability: 270.3416245|-4.6503027|302.9962235|4.4992846|-25.9462454|249.7393691 unknown
InChI: InChI=1S/C22H19Cl2NO3/c1-22(2)17(12-19(23)24)20(22)21(26)28-18(13-25)14-7-6-10-16(11-14)27-15-8-4-3-5-9-15/h3-12,17-18,20H,1-2H3
charge 0 multiplicity 1
47 atoms
Cl 4.585944 1.088984 3.653809
Cl 2.618678 1.832816 1.475944
O  0.116678 -1.903027 -0.350951
O  -0.217344 -3.731423 1.070001
O  -3.092854 2.636616 0.111786
N  -1.387641 -1.635241 -3.384574
C  3.163304 -2.562218 -0.040791
C  2.726337 -1.331045 0.776221
C  1.976505 -2.691707 0.968721
C  2.904894 -2.541712 -1.545601
C  4.434923 -3.318478 0.346635
C  3.527586 -0.783962 1.893525
C  0.549654 -2.857625 0.599052
C  3.56521 0.512883 2.277661
C  -1.342702 -2.004996 -0.746213
C  -2.165553 -1.00087 0.044865
C  -1.361887 -1.792204 -2.203188
C  -2.208623 0.359663 -0.340671
C  -2.858914 -1.445417 1.196753
C  -2.940948 1.274009 0.447539
C  -3.602592 -0.51878 1.96141
C  -3.646783 0.841837 1.59428
C  -2.08325 3.329039 -0.615663
C  -0.707018 3.175056 -0.329513
C  -2.53503 4.265016 -1.56934
C  0.227737 3.968261 -1.031401
C  -1.588316 5.055557 -2.257936
C  -0.205916 4.907752 -1.996332
H  2.148815 -0.594142 0.20957
H  2.212133 -3.260202 1.874043
H  2.800372 -3.570952 -1.937348
H  3.761858 -2.069866 -2.061086
H  1.994469 -1.980847 -1.807585
H  5.325617 -2.805261 -0.061344
H  4.408894 -4.340136 -0.073684
H  4.567786 -3.414902 1.438376
H  4.152577 -1.477157 2.470276
H  -1.671265 -3.035921 -0.510836
H  -1.689633 0.698016 -1.243641
H  -2.804046 -2.497779 1.494589
H  -4.146195 -0.856099 2.849806
H  -4.215253 1.576076 2.172529
H  -0.37232 2.462765 0.431547
H  -3.608866 4.361214 -1.754896
H  1.29597 3.855596 -0.815209
H  -1.932209 5.783136 -3.001062
H  0.524916 5.519776 -2.535174
