program: Gaussian 09
title: 000028381
version: EM64L-G09RevD.01
frameworkgroup: C1[X(C21H25NO2)]
method: RPBEPBE
basis: SDD
operation: Freq
keyword: #p
keyword: freq=noraman
keyword: PBEPBE/SDD
title: #p freq=noraman PBEPBE/SDD
converged: YES YES NO NO
title: Mulliken charges:
elementType: O O N C C C C C C C C C C C C C C C C C C C C C H H H H H H H H H H H H H H H H H H H H H H H H H
charge: -0.319217 -0.267811 -0.090856 -0.015832 -0.575722 -0.480556 -0.439071 0.330234 0.277689 0.380746 0.391499 -0.599629 -0.387958 -0.458855 -0.474620 -0.276012 0.329181 -0.370185 -0.256926 -0.235494 -0.390283 -0.614251 -0.614496 -0.535995 0.241141 0.237655 0.237681 0.227164 0.232122 0.293374 0.249737 0.241363 0.241524 0.205823 0.219956 0.246550 0.223766 0.223580 0.217062 0.195061 0.221766 0.190001 0.225822 0.228110 0.221855 0.188915 0.219795 0.241047 0.223554
chargesum: 0.00000
title: Mulliken charges with hydrogens summed into heavy atoms:
elementType: O O N C C C C C C C C C C C C C C C C C C C C C
charge: -0.319217 -0.267811 -0.090856 -0.015832 -0.334581 -0.005219 0.020214 0.330234 0.277689 0.380746 0.391499 -0.306256 -0.138221 -0.217492 -0.233096 0.149766 0.329181 -0.123634 -0.033160 -0.011914 0.021839 0.023338 0.024383 0.148401
polarizability: 2.58417168e+02 1.24748229e+00 2.67019562e+02 -1.62938618e+01 2.84531776e+00 1.80740382e+02
1716.lowfreq: -6.6656 0.0001 0.0004 0.0005 4.2954 10.8240 23.5311 28.0283 42.4695
frequency: 23.1243 27.3584 42.4650 52.4577 78.0561 87.2158 121.3738 132.4328 137.3254 155.8416 160.2280 197.0438 199.0690 212.8237 214.9062 222.0615 239.2631 251.7998 281.0670 311.9123 330.5720 345.4323 372.1992 389.3855 406.9414 414.6444 423.8026 447.7767 459.0559 470.8578 490.8329 534.0859 553.4680 559.8382 596.0768 631.0400 633.2237 658.4450 686.9300 744.4291 761.6849 770.1292 778.8485 800.9046 808.1256 824.9251 830.0064 853.1866 864.0096 876.4649 888.1247 890.9289 911.6407 945.8618 948.4217 958.3341 983.6080 993.7025 1007.0835 1021.3964 1027.4419 1029.3662 1034.0716 1035.3408 1048.2464 1064.1752 1089.4734 1093.6897 1105.2126 1113.8516 1127.1191 1135.3339 1139.3208 1151.7698 1156.8191 1164.5390 1170.4635 1181.2382 1188.8601 1195.2831 1200.4544 1226.9913 1243.2676 1246.8787 1264.7373 1266.7511 1274.4706 1288.3867 1301.4410 1302.7878 1320.8419 1330.2651 1385.4931 1390.9239 1392.3226 1418.8323 1422.0079 1440.7450 1441.7606 1446.7105 1458.6405 1460.4881 1461.6881 1464.4719 1466.9483 1470.6851 1474.0042 1475.6436 1476.3769 1485.4493 1487.4071 1493.7720 1590.9389 1598.4228 1614.2482 1622.5788 2849.9218 2859.5462 2883.5398 2956.6973 2966.7700 2999.5925 3013.6592 3019.0685 3022.2448 3027.9771 3042.5098 3046.5250 3051.2625 3057.1325 3078.2386 3080.6734 3085.9785 3118.7233 3121.1312 3127.4468 3130.5124 3147.3665 3162.0132 3166.7160 3181.0580
redmass: 2.6719 4.0337 4.0733 4.3243 3.6372 2.6092 3.0182 3.8563 3.5666 3.0729 2.8935 2.2415 2.7334 1.4944 1.8406 1.1098 5.4938 1.4275 2.4454 3.5297 4.3118 3.2794 3.1586 4.2794 4.2407 3.6338 2.4888 3.7276 3.8145 3.7169 4.7551 4.2193 4.6156 3.9455 6.2888 4.0871 5.3289 4.5938 6.1068 4.4495 1.2947 2.5153 3.0863 2.7737 1.5118 2.4363 1.6454 4.3448 2.2286 1.7718 1.9279 1.7377 2.3476 1.4065 1.3834 6.3754 1.3159 5.4986 3.5123 2.7403 2.6723 2.4759 1.5722 3.0776 3.4275 1.8764 1.3460 2.2625 1.7839 1.2608 1.5741 1.3765 1.5063 1.4812 1.4367 1.4304 1.1198 1.9272 1.5221 2.4501 1.5990 2.2761 1.6878 1.3149 2.3558 2.4549 1.4994 1.2466 1.5224 1.6831 1.4377 1.4237 1.4448 6.3894 5.9956 1.1459 2.1000 1.1629 1.8660 2.2452 1.3904 1.5037 1.0630 1.0516 1.0640 1.3548 1.0820 1.1053 1.0540 1.0546 1.8856 1.0829 6.9197 7.8354 7.1819 7.3302 1.0570 1.0586 1.0681 1.0330 1.0572 1.0576 1.0610 1.0730 1.0952 1.0738 1.1036 1.0985 1.0876 1.1047 1.1009 1.1057 1.1004 1.0861 1.0993 1.0896 1.0892 1.0936 1.0994 1.0949 1.0906
irintensity: 0.3348 0.0320 0.9991 0.6802 2.1585 1.0815 3.1161 4.6578 0.2117 1.8987 0.6283 1.1556 1.3545 0.6932 0.2044 0.9344 4.8108 1.4467 0.6110 6.6865 1.3383 4.3647 1.2670 1.1273 1.8394 0.1678 0.2842 0.5926 4.5599 4.2577 1.0644 11.7569 13.0793 10.3731 11.0944 0.7290 10.9293 3.0542 4.9453 1.9303 60.0472 0.1059 17.5761 1.8435 11.0070 6.6899 42.1616 3.0900 19.8174 7.7764 1.9030 14.7694 3.4146 0.9163 0.2940 26.3413 0.1266 31.4453 14.7939 4.5796 4.3125 8.6114 15.7537 16.2754 154.4650 23.0879 7.8615 2.7650 8.0574 0.3648 17.9331 36.5371 8.7589 33.2833 15.4513 23.2385 2.9641 5.3174 8.3772 10.7754 41.0717 43.9471 6.2300 6.1545 37.8660 17.1124 38.1628 4.8385 32.2469 5.3436 4.2997 1.5616 1.0573 4.9240 3.3782 2.7098 26.3000 3.5109 17.0815 2.8706 29.7123 37.2450 20.5302 11.5559 5.0566 79.2369 23.1883 4.0745 14.3707 9.8965 37.8137 7.1714 6.0496 1.7597 16.5717 56.1735 67.8372 156.5228 119.6876 60.4159 38.9913 30.4005 56.3155 36.2296 17.4722 45.8306 44.9281 53.4478 36.5203 0.6997 35.3549 54.6548 49.2027 2.9740 32.4462 12.8139 11.0316 33.1081 31.3551 11.7643 5.3928
temp: 298.150 k
press: 1.00000 atm
elementType: 8 8 7 6 6 6 6 6 6 6 6 6 6 6 6 6 6 6 6 6 6 6 6 6 1 1 1 1 1 1 1 1 1 1 1 1 1 1 1 1 1 1 1 1 1 1 1 1 1
symmnumber: 1
zpe: 1077655.9 jmol-1
zpe.correction: 0.410457 hartree
zpe.thermalcorrener: 0.432761 hartree
zpe.thermalcorrenthalpy: 0.433705 hartree
zpe.thermalcorrgfe: 0.358600 hartree
zpe.sumelectzpe: -1018.626272 hartree
zpe.sumelectthermal: -1018.603969 hartree
zpe.sumelectthermalent: -1018.603025 hartree
zpe.sumelectthermalfe: -1018.678130 hartree
dipole: 2.3913 0.1839 0.8784
dipole: 2.5542
quadrupole: -135.9569 -133.8260 -139.6030
quadrupole: 12.7201 -5.6891 -1.4251
quadrupole: 0.5050 2.6360 -3.1411 12.7201 -5.6891 -1.4251
hfenergy: -1019.0367298 hartree
pointgroup: C01 [X(C21H25N1O2)]
dipole: 0.9164972 -0.215621 -0.3512083 debye
polarizability: 257.9449006|-0.740275|266.8672714|17.2278287|5.2250792|181.3649397 unknown
InChI: InChI=1S/C21H25NO2/c1-22(2)12-13-24-21-11-10-16(17-6-4-5-7-19(17)21)18-9-8-15(23-3)14-20(18)21/h4-9,14,16H,10-13H2,1-3H3
charge 0 multiplicity 1
49 atoms
O  1.122728 -0.766804 -0.129408
O  -3.339096 -3.30034 0.593296
N  4.790216 -1.485332 -0.248184
C  0.145585 0.256949 -0.492762
C  -1.76357 1.988543 -1.017238
C  0.226392 0.70858 -2.005183
C  -0.905526 1.742454 -2.315846
C  -1.261669 -0.31428 -0.301756
C  0.229782 1.532955 0.359584
C  -2.288087 0.621298 -0.585405
C  -0.794985 2.472365 0.058359
C  -1.549476 -1.633382 0.090325
C  1.168723 1.802768 1.371947
C  -3.635748 0.221389 -0.475886
C  -0.855212 3.697585 0.749022
C  2.501735 -0.56586 -0.610309
C  -2.910493 -2.017649 0.203685
C  -3.950093 -1.095826 -0.07868
C  1.102936 3.033498 2.071229
C  0.101312 3.980528 1.756209
C  3.386141 -1.503452 0.226116
C  5.008461 -2.326176 -1.443565
C  5.764671 -1.788226 0.81969
C  -2.304683 -4.285323 0.910278
H  -2.574784 2.711214 -1.209962
H  0.125261 -0.193037 -2.635673
H  1.217112 1.155515 -2.198908
H  -0.474477 2.701412 -2.655064
H  -1.566241 1.364573 -3.116069
H  -0.721735 -2.314908 0.296799
H  1.92407 1.054976 1.633864
H  -4.443226 0.930051 -0.693781
H  -1.646035 4.421336 0.518317
H  2.564871 -0.815369 -1.68851
H  2.832688 0.481768 -0.475239
H  -4.986521 -1.431717 0.022346
H  1.827134 3.24867 2.865125
H  0.05547 4.929507 2.302404
H  3.359037 -1.160195 1.276553
H  2.940831 -2.529073 0.210782
H  4.312183 -2.037348 -2.249363
H  4.866284 -3.418778 -1.241044
H  6.036998 -2.177708 -1.818316
H  5.634125 -1.080503 1.657215
H  6.790795 -1.665626 0.428083
H  5.67567 -2.82813 1.225819
H  -1.661994 -4.493845 0.032271
H  -2.851307 -5.196761 1.19455
H  -1.672154 -3.949283 1.755182
