program: Gaussian 09
title: 000028276
version: EM64L-G09RevD.01
frameworkgroup: C1[X(C18H28N2O2)]
method: RPBEPBE
basis: SDD
operation: Freq
keyword: #p
keyword: freq=noraman
keyword: PBEPBE/SDD
title: #p freq=noraman PBEPBE/SDD
converged: YES YES NO NO
title: Mulliken charges:
elementType: O O N N C C C C C C C C C C C C C C C C C C H H H H H H H H H H H H H H H H H H H H H H H H H H H H
charge: -0.336025 -0.278175 -0.124066 -0.469808 0.039159 -0.069155 -0.457944 -0.473714 -0.398609 -0.383025 -0.305924 -0.413532 -0.723471 -0.696152 0.253142 0.315960 0.270326 -0.351368 -0.383644 -0.845129 -0.234072 -0.251735 0.160241 0.272523 0.230616 0.192210 0.204561 0.232838 0.201223 0.193682 0.198517 0.211149 0.174124 0.206024 0.226503 0.256718 0.230136 0.218003 0.212114 0.223038 0.218862 0.216565 0.353064 0.299159 0.227003 0.232505 0.230703 0.242734 0.226173 0.225972
chargesum: 0.00000
title: Mulliken charges with hydrogens summed into heavy atoms:
elementType: O O N N C C C C C C C C C C C C C C C C C C
charge: -0.336025 -0.278175 -0.124066 -0.116744 0.199400 0.203369 -0.035118 -0.036315 -0.003703 0.026641 0.074224 0.069689 -0.063219 -0.037687 0.253142 0.315960 0.270326 -0.052209 -0.156641 -0.139186 -0.007900 -0.025763
polarizability: 2.76647310e+02 1.62645601e+01 1.77734703e+02 1.30735045e+00 9.64870377e+00 2.03487944e+02
1716.lowfreq: -17.7712 -3.9213 -0.0003 -0.0001 0.0006 5.9533 11.2340 21.1374 30.9688
frequency: 9.0773 21.0241 30.6479 56.2201 60.0246 70.8118 82.3873 95.8838 114.7491 117.6004 171.4919 176.1039 191.6702 197.7422 203.1354 216.1750 225.1289 268.7244 281.2056 287.0510 292.4161 315.6801 319.3574 335.4102 384.7456 411.2992 426.6124 444.7860 464.3785 494.1414 508.9173 525.6662 540.1933 569.5555 597.9982 618.3368 645.9866 696.9629 717.3030 728.2122 742.3184 765.4429 770.6324 774.3808 795.4601 807.9356 818.1077 838.5869 861.8827 878.9389 881.9772 904.5253 906.6236 935.0419 950.4682 955.5344 981.1159 988.7506 991.4677 999.3443 1043.3554 1043.8692 1047.2762 1048.4506 1056.5743 1065.4689 1083.3410 1098.7864 1101.2996 1114.1334 1118.5098 1142.4577 1162.3841 1171.4287 1173.8252 1196.7561 1198.9083 1212.1956 1236.3828 1252.9355 1270.5254 1282.3395 1298.6087 1302.4629 1308.9780 1313.8552 1325.6113 1334.5736 1336.4994 1343.2045 1345.0274 1361.4981 1372.7011 1378.1434 1379.2230 1384.0782 1387.9486 1399.0897 1442.0284 1455.2595 1456.9976 1459.7464 1466.7412 1468.1465 1468.8129 1474.8637 1479.8538 1480.9254 1482.5964 1489.9933 1495.2814 1508.2914 1522.6558 1598.2181 1619.0185 1655.5072 2800.7625 2843.3701 2955.1460 2963.0384 2976.6267 2979.6025 2984.1105 2988.4727 3004.8581 3019.3172 3024.2312 3031.8981 3041.6330 3043.1208 3050.2747 3053.1316 3056.5087 3068.1125 3073.1680 3078.4890 3082.7532 3086.9595 3088.0465 3121.7698 3136.4693 3160.2686 3188.2364 3552.3594
redmass: 4.0040 3.9884 3.1940 4.2001 5.7245 2.9639 3.2865 3.0613 3.2645 3.6648 1.3662 2.5182 1.0797 2.6533 2.5995 2.0766 2.3242 1.9283 2.9308 3.9122 3.5798 2.2622 3.1569 3.3336 2.4065 2.9026 2.9383 2.9793 2.1389 2.8166 3.1919 4.7298 3.1433 2.7151 5.2634 3.5490 1.3901 5.1030 5.2022 2.8365 2.5266 1.3430 3.0361 1.1849 1.8454 2.6993 1.5546 2.5414 2.5140 1.3047 2.7569 1.8476 1.8767 2.6502 1.3684 2.5570 1.6328 5.0062 1.3079 2.7889 1.5211 1.4784 2.2505 2.1060 2.0887 2.0456 2.0254 2.0715 1.4647 1.9020 1.8444 1.7391 2.7031 2.3304 1.1005 2.1604 2.0374 1.7445 1.3593 1.2021 2.1156 1.1778 1.2040 1.5344 1.3857 1.2898 1.3984 1.3810 1.4149 1.4172 1.3131 1.4300 1.3327 1.5721 2.5611 1.3507 1.3090 1.2867 2.1935 1.5831 1.2174 1.0924 1.0624 1.0508 1.0758 1.0959 1.0476 1.0440 1.0475 1.3769 1.0793 1.0780 2.1248 5.6380 5.8435 8.0198 1.0786 1.0722 1.0398 1.0637 1.0356 1.0627 1.0356 1.0627 1.0627 1.0637 1.0978 1.0936 1.0962 1.0878 1.0876 1.1022 1.0965 1.1021 1.0990 1.0977 1.1003 1.0951 1.1003 1.0870 1.0900 1.0982 1.0950 1.0752
irintensity: 0.3626 0.7608 0.5182 0.5662 2.8544 0.1643 1.6357 1.0608 0.0772 0.0452 0.7773 0.3918 0.9993 0.5161 1.3912 3.5629 4.1132 0.7126 1.1599 6.4565 4.8338 0.3543 7.1470 3.3595 1.3026 5.0634 3.8344 8.0929 2.2364 5.0985 2.0589 1.1548 5.5131 8.2381 1.0950 4.0072 32.7573 42.2450 2.4130 0.5292 8.3290 93.1430 3.6999 17.1156 2.8673 11.1725 1.6727 18.2329 10.1203 2.8219 10.2106 2.6628 12.4106 1.9033 3.3028 6.7184 71.4814 213.9535 2.2911 58.4394 6.6588 7.9654 12.1477 16.7689 10.9870 57.0023 14.6307 41.6906 3.2876 23.0066 8.2751 9.3919 498.5665 8.8482 1.9654 16.0293 15.5588 12.3826 1.2581 3.2196 10.4082 17.4943 15.6963 29.6783 2.0624 0.0733 2.2773 8.3944 2.2388 3.1672 12.2364 22.4864 13.0015 14.9063 66.8948 12.7124 12.2718 19.9156 28.3829 157.6147 34.9836 5.1270 11.8672 15.6057 13.6122 11.3796 2.5418 14.5170 12.0507 39.3059 4.3549 7.2750 480.5566 109.8867 18.7789 189.7644 72.0748 122.5896 30.0900 44.4889 21.0742 28.8038 34.4181 29.3450 23.2032 27.5631 21.5634 56.7377 34.4480 22.5765 10.8365 51.7399 4.6513 50.4275 35.9082 117.4564 24.2881 19.5947 44.8566 8.3920 19.7952 29.7971 7.7509 30.7691
temp: 298.150 k
press: 1.00000 atm
elementType: 8 8 7 7 6 6 6 6 6 6 6 6 6 6 6 6 6 6 6 6 6 6 1 1 1 1 1 1 1 1 1 1 1 1 1 1 1 1 1 1 1 1 1 1 1 1 1 1 1 1
symmnumber: 1
zpe: 1134261.6 jmol-1
zpe.correction: 0.432017 hartree
zpe.thermalcorrener: 0.454974 hartree
zpe.thermalcorrenthalpy: 0.455918 hartree
zpe.thermalcorrgfe: 0.377495 hartree
zpe.sumelectzpe: -960.971278 hartree
zpe.sumelectthermal: -960.948321 hartree
zpe.sumelectthermalent: -960.947376 hartree
zpe.sumelectthermalfe: -961.025800 hartree
dipole: 1.4488 0.7651 2.0514
dipole: 2.6254
quadrupole: -122.4641 -133.2539 -132.1179
quadrupole: 0.9224 -7.0211 1.8305
quadrupole: 6.8145 -3.9752 -2.8393 0.9224 -7.0211 1.8305
hfenergy: -961.4032949 hartree
pointgroup: C01 [X(C18H28N2O2)]
dipole: 0.5172568 0.5607969 0.6962954 debye
polarizability: 270.0366627|28.7383704|189.986686|-6.7804704|13.1838804|197.846609 unknown
InChI: InChI=1S/C18H28N2O2/c1-4-20(5-2)16-12-8-9-13-17(16)22-18(21)19-15-11-7-6-10-14(15)3/h6-7,10-11,16-17,19H,4-5,8-9,12-13H2,1-3H3
charge 0 multiplicity 1
50 atoms
O  0.494449 0.756136 -0.227879
O  -0.6438 -0.520802 -1.854318
N  3.077654 -0.487675 0.578494
N  -1.617301 0.117423 0.21779
C  2.952192 0.77852 -0.21004
C  1.698663 0.826237 -1.11577
C  2.960645 2.034194 0.707307
C  1.628213 2.129408 -1.937761
C  2.919792 3.344214 -0.116905
C  1.685889 3.388924 -1.046091
C  4.424865 -0.618872 1.201858
C  2.637183 -1.731242 -0.114024
C  4.53171 -1.779658 2.209353
C  3.481017 -2.192434 -1.335792
C  -0.613404 0.054054 -0.735178
C  -2.924951 -0.440963 0.158017
C  -3.783135 -0.225382 1.282621
C  -3.377479 -1.184504 -0.962841
C  -5.086694 -0.770734 1.242661
C  -3.313541 0.569234 2.49038
C  -4.68494 -1.71367 -0.968962
C  -5.547694 -1.511557 0.130687
H  3.81412 0.88224 -0.926398
H  1.64937 -0.036384 -1.802257
H  2.082763 1.971737 1.376763
H  3.859999 2.040872 1.347927
H  2.481987 2.131139 -2.645878
H  0.706179 2.11289 -2.5482
H  2.915332 4.21388 0.567948
H  3.843642 3.424016 -0.727872
H  1.707892 4.296307 -1.679438
H  0.766145 3.441493 -0.431873
H  5.232289 -0.72188 0.430687
H  4.637801 0.317368 1.745354
H  2.629957 -2.539491 0.638895
H  1.584382 -1.609612 -0.418921
H  3.708655 -1.723852 2.944161
H  4.496634 -2.770764 1.723077
H  5.491225 -1.713352 2.754636
H  3.044998 -3.113046 -1.76594
H  4.525579 -2.415262 -1.050927
H  3.503593 -1.429191 -2.135543
H  -1.357048 0.625977 1.064688
H  -2.704183 -1.338094 -1.80852
H  -5.749634 -0.609237 2.101327
H  -2.428874 0.110658 2.976906
H  -3.048398 1.613282 2.226958
H  -4.10827 0.621292 3.252461
H  -5.025453 -2.28597 -1.839042
H  -6.562714 -1.922671 0.125615
