program: Gaussian 09
title: 000028466
version: EM64L-G09RevD.01
frameworkgroup: C1[X(C22H30N2O)]
method: RPBEPBE
basis: SDD
operation: Freq
keyword: #p
keyword: freq=noraman
keyword: PBEPBE/SDD
title: #p freq=noraman PBEPBE/SDD
converged: YES YES NO NO
title: Mulliken charges:
elementType: O N N C C C C C C C C C C C C C C C C C C C C C C H H H H H H H H H H H H H H H H H H H H H H H H H H H H H H
charge: -0.275382 -0.245885 -0.057995 -0.360910 -0.382798 0.057054 -0.417032 0.159018 -0.500811 0.377319 0.365077 -0.581022 -0.409836 -0.386027 0.498016 -0.813630 -0.835514 -0.240061 -0.624244 -0.621965 -0.417800 -0.405029 -0.227449 -0.230417 -0.244580 0.240633 0.207273 0.208785 0.242324 0.217964 0.206542 0.234545 0.257913 0.252551 0.210413 0.235928 0.235244 0.234903 0.241424 0.227399 0.226250 0.241375 0.262445 0.227361 0.223167 0.188120 0.221662 0.219020 0.191248 0.228529 0.237327 0.230270 0.222835 0.222310 0.226145
chargesum: 0.00000
title: Mulliken charges with hydrogens summed into heavy atoms:
elementType: O N N C C C C C C C C C C C C C C C C C C C C C C
charge: -0.275382 -0.245885 -0.057995 0.086996 0.068312 0.057054 0.007474 0.159018 -0.008353 0.377319 0.365077 -0.118059 -0.173908 -0.150783 0.498016 -0.109904 -0.105444 -0.012700 0.008705 0.016832 -0.180473 -0.174759 -0.004614 -0.008107 -0.018436
polarizability: 2.67531464e+02 -1.31225496e+01 2.62156094e+02 -1.32975200e+01 -1.02814420e+01 2.18849769e+02
1716.lowfreq: -13.1170 -0.0004 0.0003 0.0003 3.5501 4.4702 11.2178 13.4017 19.2717
frequency: 10.1326 12.7586 18.6891 25.9410 38.0020 39.9949 41.1391 59.9555 77.1167 78.7779 93.9701 104.2613 112.2241 133.6850 146.1938 152.1129 193.3989 203.8743 218.7030 226.0709 244.3489 251.0690 259.4902 275.6059 310.6735 331.0234 356.2752 362.4462 388.4998 401.9900 404.0387 408.7723 467.6982 477.9555 494.7617 513.8404 517.3906 542.7669 548.3533 568.3468 596.1590 616.6429 618.1897 700.8812 707.5844 751.5222 758.2007 760.9652 764.9445 784.7087 788.2819 807.4516 825.6147 848.0469 854.1625 903.4741 916.3287 917.9975 945.1616 975.7177 978.7256 980.4867 981.1741 989.8813 992.6467 997.0193 1016.2818 1026.6609 1029.1996 1038.1011 1041.5785 1042.7983 1046.2683 1055.0212 1062.0921 1077.6067 1087.4455 1092.5734 1101.7083 1141.4613 1141.7072 1164.3288 1171.2892 1179.2993 1186.3375 1218.0179 1235.0277 1245.7205 1256.4971 1259.7108 1266.3460 1267.7054 1281.0679 1285.8861 1300.7663 1327.2272 1332.2999 1340.4998 1358.3083 1358.7005 1369.6731 1379.2137 1381.8696 1397.0627 1398.7914 1420.7147 1434.6757 1437.7028 1440.1760 1441.4650 1451.1252 1453.3061 1455.1213 1455.3296 1465.5525 1467.8853 1472.2835 1477.8492 1482.1194 1483.2965 1483.9744 1484.7651 1486.8694 1498.0527 1573.1183 1592.8161 1595.0711 1600.7267 1614.2507 2853.8434 2868.0673 2958.2753 2975.0570 2981.1261 2987.1562 2989.8482 3000.5114 3002.6089 3006.6727 3009.9482 3015.7598 3050.8036 3054.1153 3055.4206 3060.4889 3066.4201 3072.3831 3076.7181 3077.2494 3091.2969 3107.9663 3113.3717 3114.8487 3120.1992 3128.9372 3130.4968 3141.9832 3156.2533 3160.9775
redmass: 3.9815 3.7903 4.6276 3.9286 2.8075 3.6045 2.9278 3.8210 3.1449 2.5088 2.5485 1.6422 1.1861 2.9535 1.8519 2.7781 4.1191 3.5625 2.5139 1.2107 1.0877 3.3918 3.1494 3.6773 2.8617 2.4844 3.0655 2.8129 3.1661 3.8626 2.8872 1.9788 3.5047 3.7356 3.3979 3.7597 3.0438 4.5417 4.9801 4.3643 4.0443 4.0679 5.6006 3.1864 1.9291 2.4456 2.0666 1.5880 4.1192 1.2219 1.3454 3.9711 2.1881 1.9620 1.2496 1.3080 1.6824 2.3038 2.8323 1.4077 2.4111 1.5606 1.5497 6.2773 1.3180 2.3896 3.8643 2.2371 1.7824 2.6118 1.7590 1.4423 1.5550 2.6218 3.2303 1.7972 1.7314 1.2798 1.6773 1.3161 1.3707 1.6476 1.0532 1.1611 1.1153 2.4140 3.6736 1.8127 1.6825 1.3578 1.5233 1.9988 1.5631 2.2094 1.4644 1.2553 1.4264 1.4340 1.2595 6.0577 1.5166 1.8968 7.4637 1.2299 1.2490 1.1318 1.1210 1.5230 2.1674 1.4356 1.1045 1.1136 1.9017 1.0678 1.0662 1.0839 1.0854 1.1320 1.3668 1.2902 1.0542 1.5573 1.1777 1.0564 6.9816 6.0705 7.0628 5.7912 6.1833 1.0564 1.0565 1.0594 1.0403 1.0418 1.0626 1.0590 1.0619 1.0592 1.0720 1.0731 1.1000 1.1023 1.0964 1.0928 1.0933 1.1010 1.1005 1.1053 1.1020 1.1000 1.0975 1.0865 1.0871 1.0858 1.0919 1.0909 1.0959 1.0993 1.1015
irintensity: 0.1875 0.0727 0.1950 0.2538 0.3517 0.1559 0.2257 1.1176 0.4013 0.7557 0.8622 0.7413 1.2314 0.1431 0.5943 0.9483 3.8971 1.0993 0.1170 2.5978 0.2230 0.8484 7.7343 8.9936 9.3355 2.9309 2.0027 10.3192 9.1031 1.4173 0.1390 0.0396 1.4851 18.3796 8.4698 17.0887 0.6487 12.4618 1.5479 5.0696 2.1783 7.3021 0.9894 5.9972 49.7316 10.2698 32.8881 5.3942 5.2809 45.8333 2.7807 9.2508 1.1478 0.4048 0.0370 0.0531 2.2270 0.3272 10.2705 0.1743 3.0729 4.7461 1.6802 0.0469 0.4281 9.0446 19.0412 2.1001 5.7594 38.4435 4.5461 5.7086 2.7642 33.0869 13.7545 48.0470 2.8761 11.1686 10.2442 8.8213 1.1656 13.8944 0.1890 2.3334 0.4914 2.9233 28.6817 65.5135 1.1827 27.7894 4.1026 20.9156 6.5554 12.3144 79.8424 0.1172 6.4367 16.3886 30.6269 3.0257 44.2944 66.5584 1.5647 27.9482 6.5824 6.2060 8.8804 8.3645 6.1002 22.8864 13.8498 4.1685 6.3384 10.3753 10.3453 33.4586 4.0725 2.6649 16.5774 42.1727 3.3401 10.5176 34.8172 12.7054 238.1274 1.0428 5.3902 9.3869 13.1817 70.7260 138.8881 33.8438 24.9929 20.4986 1.2263 9.6517 24.4655 46.4791 61.9942 75.9308 17.8251 4.2806 1.3783 21.2471 21.0898 20.2443 49.2467 21.9291 43.6351 16.4067 8.2672 10.6758 5.0992 0.3085 21.9682 11.6608 44.9098 31.5816 26.3299
temp: 298.150 k
press: 1.00000 atm
elementType: 8 7 7 6 6 6 6 6 6 6 6 6 6 6 6 6 6 6 6 6 6 6 6 6 6 1 1 1 1 1 1 1 1 1 1 1 1 1 1 1 1 1 1 1 1 1 1 1 1 1 1 1 1 1 1
symmnumber: 1
zpe: 1232354.1 jmol-1
zpe.correction: 0.469379 hartree
zpe.thermalcorrener: 0.496252 hartree
zpe.thermalcorrenthalpy: 0.497197 hartree
zpe.thermalcorrgfe: 0.406807 hartree
zpe.sumelectzpe: -1039.187220 hartree
zpe.sumelectthermal: -1039.160347 hartree
zpe.sumelectthermalent: -1039.159402 hartree
zpe.sumelectthermalfe: -1039.249792 hartree
dipole: 0.0092 3.5115 1.5370
dipole: 3.8332
quadrupole: -155.8883 -148.6345 -144.8819
quadrupole: -0.5763 1.3204 -8.9865
quadrupole: -6.0867 1.1670 4.9197 -0.5763 1.3204 -8.9865
hfenergy: -1039.656599 hartree
pointgroup: C01 [X(C22H30N2O1)]
dipole: 0.0197111 1.4138198 -0.5244782 debye
polarizability: 268.0923968|13.6691583|260.4588117|-11.9916951|12.962997|219.9861183 unknown
InChI: InChI=1S/C22H30N2O/c1-18-10-8-11-19(2)22(18)24(17-9-16-23(3)4)21(25)15-14-20-12-6-5-7-13-20/h5-8,10-13H,9,14-17H2,1-4H3
charge 0 multiplicity 1
55 atoms
O  -0.414226 -2.180013 0.915186
N  -0.97072 0.050591 0.584438
N  -5.776077 -1.555498 -0.164888
C  -2.33244 -0.224388 1.125703
C  -3.330059 -0.749516 0.071371
C  -0.677467 1.395347 0.124066
C  -4.717302 -1.030518 0.723876
C  -0.063947 -1.013479 0.543438
C  1.362535 -0.727556 0.06319
C  -0.467514 2.419533 1.098826
C  -0.634147 1.685991 -1.272301
C  2.405322 -1.515591 0.906184
C  -0.224614 3.740755 0.652774
C  -0.390249 3.023779 -1.674687
C  3.809029 -1.374893 0.337632
C  -0.48358 2.111653 2.585753
C  -0.808978 0.61052 -2.329881
C  -0.190401 4.046139 -0.725023
C  -6.225434 -0.618271 -1.207317
C  -5.533924 -2.917176 -0.672139
C  4.303072 -2.30641 -0.612469
C  4.643921 -0.290922 0.714316
C  5.592344 -2.159036 -1.172575
C  5.934106 -0.138547 0.158104
C  6.413109 -1.072594 -0.789764
H  -2.221082 -0.978245 1.926871
H  -2.714604 0.71387 1.568309
H  -3.442293 -0.004598 -0.740072
H  -2.92361 -1.679886 -0.366379
H  -4.580158 -1.758308 1.548927
H  -5.096811 -0.092862 1.180401
H  1.441037 -1.061533 -0.990699
H  1.590459 0.352129 0.075476
H  2.087724 -2.572771 0.931859
H  2.373537 -1.144709 1.948489
H  -0.053955 4.530832 1.393634
H  -0.358468 3.25778 -2.745548
H  -1.51336 2.117501 2.993326
H  -0.062312 1.113731 2.798881
H  0.093938 2.864947 3.148411
H  -1.316347 1.01741 -3.222078
H  0.17336 0.22292 -2.662997
H  -1.390024 -0.247616 -1.957888
H  -0.003399 5.073896 -1.055314
H  -6.449953 0.363374 -0.751335
H  -5.485003 -0.453459 -2.030694
H  -7.155051 -0.999681 -1.66929
H  -6.461248 -3.309048 -1.129997
H  -4.723449 -2.985464 -1.440414
H  -5.26043 -3.581637 0.167158
H  3.674434 -3.156619 -0.906202
H  4.281725 0.434869 1.453784
H  5.958651 -2.892304 -1.900442
H  6.566008 0.702768 0.465586
H  7.414621 -0.958685 -1.219876
