program: Gaussian 09
title: 000035750
version: EM64L-G09RevD.01
frameworkgroup: C1[X(C11H10N4O2)]
method: RPBEPBE
basis: SDD
operation: Freq
keyword: #p
keyword: freq=noraman
keyword: PBEPBE/SDD
title: #p freq=noraman PBEPBE/SDD
converged: YES YES NO NO
title: Mulliken charges:
elementType: O O N N N N C C C C C C C C C C C H H H H H H H H H H
charge: -0.432547 -0.323493 -0.466534 -0.157042 -0.072677 -0.588318 0.292541 0.031368 -0.313680 0.296584 -0.299627 -0.221757 -0.250390 -0.362441 0.154670 -0.250250 0.005628 0.373870 0.321257 0.275212 0.227793 0.233855 0.240005 0.242296 0.322739 0.333156 0.387784
chargesum: 0.00000
title: Mulliken charges with hydrogens summed into heavy atoms:
elementType: O O N N N N C C C C C C C C C C C
charge: -0.044763 -0.323493 -0.092664 -0.157042 -0.072677 0.067576 0.292541 0.031368 0.007576 0.296584 -0.024415 0.006036 -0.016535 -0.122435 0.154670 -0.007954 0.005628
polarizability: 2.66562090e+02 -7.92268863e+00 1.95498305e+02 -2.61435697e-02 4.75729669e-02 6.00596645e+01
1716.lowfreq: -0.0008 -0.0004 0.0001 3.2814 7.3375 9.8604 34.9381 56.0113 98.7271
frequency: 34.9339 56.0034 98.7251 101.6021 135.3736 176.3865 188.6175 213.4951 266.5971 286.4086 302.0496 388.9670 424.3185 424.6560 440.8822 463.2666 501.7864 525.7529 537.5791 575.1320 575.3369 583.0155 600.1973 660.0688 680.0683 687.5320 751.1624 757.8724 766.0550 773.1449 786.1802 807.8716 860.8945 901.3015 904.2874 927.8263 958.3447 959.6806 981.7330 1012.5975 1013.9120 1038.0299 1068.4659 1112.6641 1132.0314 1161.3280 1176.5818 1237.5992 1247.6615 1293.9080 1318.8668 1322.8767 1348.7966 1390.4309 1441.0298 1445.1589 1450.5033 1481.1384 1506.7764 1548.3730 1554.0394 1582.5743 1605.2287 1623.5521 1658.9339 3133.9526 3140.5375 3157.1341 3173.4604 3180.5975 3188.4621 3233.4214 3531.5047 3562.9430 3722.4441
redmass: 5.1457 6.2753 5.6947 8.1958 4.7063 4.9725 7.2466 6.4311 5.0375 5.4503 7.4178 4.9468 3.1774 3.9635 1.5993 1.9909 7.5351 3.0634 1.0599 6.8531 1.2030 7.0321 4.9635 6.6235 4.8217 4.4860 5.6284 2.3853 6.0267 3.3657 1.5556 2.1232 6.0628 1.1685 1.4078 6.4722 1.3914 2.5429 1.3599 5.3339 1.3095 2.1510 2.7035 1.7175 1.5959 1.5692 1.1508 2.6472 2.1240 2.7325 1.7909 2.4047 2.5376 10.0573 2.6076 2.7657 3.3465 2.8852 3.5250 4.4464 5.7952 7.0822 1.6605 4.3609 1.9379 1.0877 1.0901 1.0920 1.0974 1.0963 1.0958 1.0814 1.0641 1.0442 1.1058
irintensity: 0.1172 0.2592 0.4683 0.0399 0.1219 11.5653 3.1410 1.0516 8.9566 1.9589 0.0301 5.0279 9.5957 8.2140 177.9050 113.6506 16.6053 12.7107 14.2297 3.9202 119.5978 6.2932 47.3757 9.2262 0.4957 52.8904 1.6082 40.5386 8.6254 0.5635 29.8929 33.7898 1.1938 96.6780 43.0844 11.7908 0.0367 0.2680 3.2382 288.0451 4.2502 60.8419 31.5812 91.6930 55.0880 144.3890 7.4603 12.0434 1.8873 63.8913 44.7933 70.2792 257.5200 15.1494 17.0694 363.7852 124.1630 6.7122 225.0333 492.6063 661.9626 142.8295 304.6874 354.6750 61.7064 9.6542 22.6125 13.6646 6.8246 4.0570 26.6828 230.9021 72.1140 104.2267 44.0041
temp: 298.150 k
press: 1.00000 atm
elementType: 8 8 7 7 7 7 6 6 6 6 6 6 6 6 6 6 6 1 1 1 1 1 1 1 1 1 1
symmnumber: 1
zpe: 531516.5 jmol-1
zpe.correction: 0.202444 hartree
zpe.thermalcorrener: 0.216431 hartree
zpe.thermalcorrenthalpy: 0.217376 hartree
zpe.thermalcorrgfe: 0.161061 hartree
zpe.sumelectzpe: -793.470615 hartree
zpe.sumelectthermal: -793.456627 hartree
zpe.sumelectthermalent: -793.455683 hartree
zpe.sumelectthermalfe: -793.511997 hartree
dipole: -1.3014 1.4222 0.0060
dipole: 1.9278
quadrupole: -89.8247 -81.0323 -103.5314
quadrupole: 9.2727 0.0167 -0.0004
quadrupole: 1.6381 10.4305 -12.0686 9.2727 0.0167 -0.0004
hfenergy: -793.6730587 hartree
pointgroup: C01 [X(C11H10N4O2)]
dipole: -0.5532671 0.5118627 0.0845138 debye
polarizability: 267.354013|-2.4221357|191.260246|-0.1713322|21.2628001|63.5058004 unknown
InChI: InChI=1S/C11H10N4O2/c12-11-13-6-5-9(15-11)14-8-4-2-1-3-7(8)10(16)17/h1-6,14,16H,12H2
charge 0 multiplicity 1
27 atoms
O  -4.005136 -1.926904 -0.369995
O  -1.784629 -2.547157 -0.478952
N  0.053564 -0.643099 -0.169022
N  2.007907 0.738959 0.060776
N  4.243666 -0.272082 -0.098378
N  3.955952 2.019296 0.27502
C  -0.987701 0.283005 -0.019456
C  -2.352587 -0.195413 -0.096017
C  -0.768865 1.674675 0.204179
C  1.439914 -0.485858 -0.14104
C  -3.43051 0.723005 0.051787
C  -1.856538 2.552195 0.345601
C  -3.195797 2.087857 0.27136
C  2.243488 -1.654878 -0.330863
C  -2.642782 -1.618069 -0.325445
C  3.636509 -1.480734 -0.298237
C  3.382015 0.786079 0.072178
H  -0.287254 -1.611782 -0.325535
H  0.263119 2.02223 0.259723
H  -4.449834 0.333017 -0.010442
H  -1.65881 3.616656 0.517224
H  -4.033779 2.782749 0.382836
H  1.794061 -2.637904 -0.492918
H  4.310502 -2.333184 -0.435666
H  3.365444 2.834991 0.407337
H  4.969849 2.087448 0.289793
H  -4.099368 -2.904198 -0.528748
