program: Gaussian 09
title: 000035761
version: EM64L-G09RevD.01
frameworkgroup: C1[X(C12H4Cl6O)]
method: RPBEPBE
basis: SDD
operation: Freq
keyword: #p
keyword: freq=noraman
keyword: PBEPBE/SDD
title: #p freq=noraman PBEPBE/SDD
converged: YES YES NO NO
title: Mulliken charges:
elementType: Cl Cl Cl Cl Cl Cl O C C C C C C C C C C C C H H H H
charge: 0.011438 0.011327 -0.001394 -0.001510 -0.025081 -0.025067 -0.258963 0.585944 0.585836 -0.260812 -0.260751 -0.220852 -0.220689 -0.218098 -0.218108 -0.216490 -0.216582 -0.098508 -0.098519 0.287194 0.287203 0.286233 0.286248
chargesum: 0.00000
title: Mulliken charges with hydrogens summed into heavy atoms:
elementType: Cl Cl Cl Cl Cl Cl O C C C C C C C C C C C C
charge: 0.011438 0.011327 -0.001394 -0.001510 -0.025081 -0.025067 -0.258963 0.585944 0.585836 -0.260812 -0.260751 -0.220852 -0.220689 0.069096 0.069095 0.069742 0.069665 -0.098508 -0.098519
polarizability: 2.83168611e+02 -1.63972943e+01 1.50330285e+02 1.11712005e-02 2.78477036e-03 1.50755139e+02
1716.lowfreq: -7.1580 -5.2746 -2.7582 -0.0020 -0.0018 0.0030 24.2192 26.3259 27.7178
frequency: 24.2002 26.3244 27.7133 65.4434 85.2348 126.2380 134.9706 140.2149 174.6359 175.5817 187.8258 198.0973 198.6414 206.0032 253.3319 295.0844 324.0974 349.1823 349.7709 384.0688 409.1784 410.2615 412.2042 502.6030 503.3821 533.7261 537.1851 544.6925 551.1355 631.2125 686.9289 722.2283 722.7958 758.7707 766.6299 798.5722 853.4546 853.8198 861.3850 861.6908 869.2066 1039.2112 1052.4617 1105.8050 1110.8535 1185.1692 1191.3473 1196.0196 1253.0666 1345.0954 1355.5038 1374.0688 1375.6907 1421.0504 1425.2811 1557.8200 1562.8843 1569.8121 1582.0530 3187.7214 3187.7768 3189.1502 3189.2058
redmass: 20.6489 22.6991 24.2772 24.9036 24.8526 25.0476 12.6675 12.3487 24.3946 24.3785 24.9391 4.8860 4.8708 20.1790 15.2599 11.4025 9.7173 32.4329 29.8277 13.2332 7.5849 8.0044 12.1264 5.1109 5.1306 7.2179 6.5367 4.7066 5.0663 5.9473 5.7938 8.6010 12.9055 11.2261 11.4660 9.2005 1.4137 1.4134 1.3773 1.3589 6.7737 4.2001 3.5233 2.6342 2.6316 1.4978 1.5617 2.9478 4.2611 4.9023 6.1906 4.9485 5.3395 3.6665 3.4089 9.5993 9.4326 8.0456 8.7196 1.0932 1.0932 1.0940 1.0940
irintensity: 0.0136 0.2359 0.0186 0.2945 0.0413 0.0910 0.3038 0.0504 0.3746 0.2862 1.0206 0.0021 0.1425 0.0813 5.0990 0.4876 3.5441 0.0162 0.1311 14.7554 0.9736 5.3114 3.9505 0.0242 0.3658 6.8369 0.4714 6.7700 13.9791 0.5307 17.2376 1.4328 128.7874 73.9261 78.7515 4.5034 42.4538 37.1424 0.8446 0.3610 2.6165 0.1573 46.1310 87.6834 1.2121 6.5763 0.7215 3.6230 210.0657 25.8458 12.4511 12.3043 17.9521 520.0752 35.9067 71.9829 67.4565 42.2495 5.7607 3.0100 2.8166 1.0921 0.6763
temp: 298.150 k
press: 1.00000 atm
elementType: 17 17 17 17 17 17 8 6 6 6 6 6 6 6 6 6 6 6 6 1 1 1 1
symmnumber: 1
zpe: 322840.8 jmol-1
zpe.correction: 0.122964 hartree
zpe.thermalcorrener: 0.141247 hartree
zpe.thermalcorrenthalpy: 0.142191 hartree
zpe.thermalcorrgfe: 0.073322 hartree
zpe.sumelectzpe: -3293.894188 hartree
zpe.sumelectthermal: -3293.875905 hartree
zpe.sumelectthermalent: -3293.874961 hartree
zpe.sumelectthermalfe: -3293.943830 hartree
dipole: -0.0002 -0.0009 -1.0616
dipole: 1.0616
quadrupole: -147.5013 -148.6691 -151.4857
quadrupole: -1.1799 0.0025 -0.0046
quadrupole: 1.7174 0.5496 -2.2670 -1.1799 0.0025 -0.0046
hfenergy: -3294.017152 hartree
pointgroup: C01[X(C12H4Cl6O1)]
dipole: 0.0000609 0.0000432 0.4176736 debye
dipolederiv: -0.0965164 0.0506471 0.0730882 0.0575292 -0.3228078 -0.3495846 0.0653416 -0.3199075 -0.3805411 -0.0965549 0.0505382 -0.0729819 0.0573668 -0.3227628 0.3495988 -0.0651845 0.3199313 -0.3807882 -0.4091838 -0.2448351 -0.1211256 -0.225941 -0.2896605 -0.1612427 -0.1099894 -0.1709685 -0.1271541 -0.4095628 -0.2448003 0.1212313 -0.2258321 -0.2894584 0.1612006 0.1100364 0.1709091 -0.1272678 -0.7946181 0.0440941 0.2328152 0.0427266 -0.0879012 -0.0536589 0.2895769 -0.0608123 -0.1791579 -0.7945943 0.0441652 -0.232896 0.0428062 -0.0878875 0.0537012 -0.289651 0.0608559 -0.1792376 -2.1358572 0.130372 -0.0000885 -0.3028888 -0.1557832 -0.0000104 -0.0003283 0.0000885 -0.2609946 1.3467092 -0.2412969 -0.2078554 0.0037495 -0.0773325 -0.1926775 -0.5952963 -0.1665169 -0.0303417 1.3464706 -0.2411474 0.2080717 0.0041038 -0.0772595 0.1926213 0.595974 0.1664018 -0.0303728 0.0373897 -0.0017124 -0.107313 -0.0183532 0.4690025 0.5850188 -0.1236475 0.5432543 0.5634428 0.0374592 -0.0015705 0.1070871 -0.0181964 0.4687992 -0.5850295 0.1234171 -0.5432774 0.5637786 0.4197137 0.3870087 0.1238313 0.3609635 0.3727908 0.2888461 0.2522218 0.2951429 0.1689169 0.420288 0.3868568 -0.1239327 0.3609533 0.372375 -0.2887309 -0.2525766 -0.2950826 0.1690481 -0.3083758 0.0779853 0.141151 0.0728965 -0.1531736 -0.125702 0.1344844 -0.1150538 -0.2291979 -0.3083983 0.0779174 -0.141101 0.0729317 -0.1531653 0.1257241 -0.1345437 0.115102 -0.2293123 -0.4466863 -0.0637936 0.0504778 -0.0822915 -0.1312321 -0.0358113 0.0605368 -0.0481139 -0.110698 -0.446747 -0.0636763 -0.0505383 -0.0823173 -0.1311708 0.0358133 -0.0604741 0.0481267 -0.1107478 1.1591672 -0.0320816 -0.384537 -0.0162932 0.08441 0.163919 -0.4252523 0.170083 0.2317662 1.1590658 -0.032172 0.3845927 -0.0164423 0.0843598 -0.1639794 0.4252986 -0.1701437 0.2319431 0.0669936 -0.0370227 -0.0111864 -0.0448919 0.1117025 -0.0435131 0.0018476 -0.046789 0.1237163 0.0670031 -0.0369998 0.0111824 -0.0448662 0.1117509 0.043513 -0.0018323 0.0467718 0.123717 0.0934019 -0.0042228 0.0141899 0.0011407 0.1021668 -0.063099 0.0225698 -0.0649295 0.0997524 0.0934327 -0.0042534 -0.0141627 0.001146 0.1022377 0.0630832 -0.0225289 0.0649279 0.0997303 unknown
polarizability: 283.2319259|16.1386732|150.2669659|-0.0023447|-0.002009|150.7551442 unknown
InChI: InChI=1S/C12H4Cl6O/c13-5-1-7(15)11(8(16)2-5)19-12-9(17)3-6(14)4-10(12)18/h1-4H
charge 0 multiplicity 1
23 atoms
Cl -1.959199 -1.911495 -2.227304
Cl 1.959711 1.911146 -2.227656
Cl -0.250126 2.155744 1.194271
Cl 0.249089 -2.154759 1.194691
Cl -5.513929 0.447913 1.314002
Cl 5.513539 -0.448243 1.314679
O  -0.000026 -0.000124 -1.096485
C  -1.235618 0.092414 -0.434495
C  1.235388 -0.092211 -0.434417
C  -2.296053 -0.712196 -0.922569
C  2.296163 0.71197 -0.922496
C  -1.5344 1.032773 0.581728
C  1.534028 -1.032323 0.582048
C  -3.600877 -0.614649 -0.407014
C  3.600901 0.614308 -0.406817
C  -2.825867 1.145038 1.131572
C  2.825335 -1.144835 1.132139
C  -3.840571 0.313221 0.62433
C  3.840298 -0.313361 0.624807
H  -4.399166 -1.250393 -0.795977
H  4.399339 1.249803 -0.795868
H  -3.029495 1.872824 1.92017
H  3.028636 -1.872464 1.920959
