program: Gaussian 09
title: 000035725
version: EM64L-G09RevD.01
frameworkgroup: C1[X(C11H18O)]
method: RPBEPBE
basis: SDD
operation: Freq
keyword: #pfreq=noraman
keyword: PBEPBE/SDD
title: #p freq=noraman PBEPBE/SDD
converged: NO YES NO NO
title: Mulliken charges:
elementType: O C C C C C C C C C C C H H H H H H H H H H H H H H H H H H
charge: -0.457058 0.308808 -0.066281 -0.038566 -0.038905 -0.506776 -0.500352 -0.496807 -0.430540 -0.433620 -0.478085 -0.479616 0.197187 0.187884 0.187965 0.210005 0.209601 0.172147 0.212023 0.211760 0.172129 0.182845 0.183114 0.183018 0.183621 0.199379 0.203835 0.203857 0.200018 0.317408
chargesum: 0.00000
title: Mulliken charges with hydrogens summed into heavy atoms:
elementType: O C C C C C C C C C C C
charge: -0.139650 0.308808 0.130906 0.149318 0.149060 -0.087170 -0.116182 -0.112918 -0.064581 -0.066980 -0.074871 -0.075740
polarizability: 1.13535675e+02 8.73578555e-02 1.06949461e+02 -5.87395875e-01 -3.43204571e-01 1.09373785e+02
1716.lowfreq: -26.3437 -0.0008 -0.0007 0.0004 8.8872 40.0076 69.6660 222.5164 227.7780
frequency: 69.1149 222.5024 227.7658 274.4110 314.1328 335.5702 357.5531 363.4651 366.6829 375.5286 407.2042 429.1211 506.0693 511.5448 578.1448 671.5982 733.0502 752.6915 778.9986 782.9082 796.0090 859.8793 863.6078 909.2926 911.7578 924.6721 941.3218 952.6137 955.6211 992.2064 1024.9165 1051.1665 1063.5041 1069.0288 1078.5514 1093.2857 1129.8079 1143.4407 1155.3165 1159.2808 1201.5853 1216.7800 1230.9929 1234.3493 1268.4415 1287.5790 1296.3574 1306.9678 1315.8029 1319.9177 1323.7254 1334.2362 1344.0438 1346.3913 1356.7512 1357.5808 1367.7826 1371.4549 1389.1293 1453.2238 1455.5249 1457.2517 1465.8097 1471.3123 1479.0367 1491.4698 2940.4024 2943.4810 2948.9458 2953.7144 2957.4379 2961.7709 2970.9864 2977.4964 2984.1217 2996.8703 2997.9663 3011.4451 3014.3746 3014.6687 3021.4210 3031.1618 3048.0820 3530.1862
redmass: 1.8521 2.2159 2.9173 2.3255 1.2001 4.3820 2.1446 3.1134 3.3083 2.1331 1.9527 2.6908 3.3537 2.1366 4.1092 4.5982 3.3661 2.7073 1.8463 1.8406 3.0847 1.5363 3.7982 1.8456 2.3775 2.2195 2.1720 2.1240 2.2991 1.8756 3.1791 2.1624 1.7381 1.6764 2.1124 1.2789 1.3384 1.1445 1.2665 1.4355 1.2701 1.1129 1.2709 1.0612 2.3524 1.3484 1.5855 1.5396 1.9942 1.4873 1.8267 1.6055 1.3024 1.6059 1.3987 1.4099 1.5329 1.4349 1.6489 1.0812 1.0840 1.0835 1.0893 1.0792 1.0964 1.0849 1.0701 1.0727 1.0643 1.0629 1.0605 1.0701 1.0720 1.0699 1.0661 1.0742 1.1007 1.1016 1.0989 1.1008 1.0987 1.1015 1.1029 1.0656
irintensity: 0.2935 1.9013 2.4203 2.9976 103.4415 0.1966 11.4584 2.9151 2.6048 0.0551 4.7087 9.4712 2.3502 0.2280 0.2733 0.6974 2.3789 5.4221 0.3031 4.5638 0.1095 0.0728 11.7705 0.7355 18.0757 0.9018 0.4109 8.2477 0.8840 0.7258 60.9124 28.5483 0.8086 1.2592 2.4163 1.3370 4.7589 7.8593 3.9583 15.8438 0.1702 3.4628 0.0524 1.4606 24.9000 1.3584 2.5637 1.7032 3.0263 19.9716 2.5130 0.0373 0.0153 5.6401 0.8704 5.2410 0.8511 0.0648 2.6750 0.1736 3.1760 8.2577 17.7191 10.1411 20.7096 4.0905 0.3966 5.4919 5.0934 85.0852 1.3484 5.2955 194.0467 80.1033 132.2578 40.5826 1.0953 2.0961 39.6664 7.9696 73.5298 95.0128 46.2898 2.6482
temp: 298.150 k
press: 1.00000 atm
elementType: 8 6 6 6 6 6 6 6 6 6 6 6 1 1 1 1 1 1 1 1 1 1 1 1 1 1 1 1 1 1
symmnumber: 1
zpe: 709274.1 jmol-1
zpe.correction: 0.270148 hartree
zpe.thermalcorrener: 0.280145 hartree
zpe.thermalcorrenthalpy: 0.281089 hartree
zpe.thermalcorrgfe: 0.235813 hartree
zpe.sumelectzpe: -504.241542 hartree
zpe.sumelectthermal: -504.231546 hartree
zpe.sumelectthermalent: -504.230602 hartree
zpe.sumelectthermalfe: -504.275878 hartree
dipole: -1.8713 0.1126 -0.8285
dipole: 2.0496
quadrupole: -81.4908 -73.1026 -69.8398
quadrupole: 0.3342 -2.5191 -0.3807
quadrupole: -6.6797 1.7085 4.9713 0.3342 -2.5191 -0.3807
hfenergy: -504.5116907 hartree
pointgroup: C01 [X(C11H18O1)]
dipole: -0.7361514 -0.0235418 0.3282676 debye
polarizability: 113.5356404|-0.0888174|106.9208752|0.5877552|-0.2171031|109.4024057 unknown
InChI: InChI=1S/C11H18O/c12-11-5-8-1-2-9(6-11)4-10(3-8)7-11/h8-10,12H,1-7H2
charge 0 multiplicity 1
30 atoms
O  2.788273 -0.049844 0.726591
C  1.360826 -0.025107 0.32161
C  -0.09556 0.106283 -1.718929
C  -0.75456 -1.547488 0.191997
C  -0.748481 1.51534 0.377512
C  1.36949 0.072133 -1.213038
C  0.683523 -1.349314 0.7532
C  0.684117 1.234413 0.917427
C  -0.808728 -1.214879 -1.327503
C  -0.798395 1.376734 -1.172365
C  -1.85489 -0.842729 1.03126
C  -1.863186 0.720523 1.11051
H  -0.090031 0.172054 -2.826221
H  -0.978998 -2.631275 0.290747
H  -0.964947 2.580116 0.610347
H  1.913908 -0.796761 -1.630234
H  1.916337 0.985238 -1.517567
H  0.660901 -1.415556 1.862628
H  1.336256 -2.169563 0.392487
H  1.343458 2.091275 0.672363
H  0.653548 1.155091 2.025772
H  -0.321955 -2.041133 -1.88604
H  -1.866771 -1.187877 -1.65922
H  -1.855688 1.399839 -1.506273
H  -0.30171 2.260514 -1.623524
H  -1.787643 -1.251019 2.060372
H  -2.833483 -1.183528 0.637215
H  -2.833303 1.092439 0.723686
H  -1.830789 1.021349 2.177611
H  2.828983 -0.116367 1.71628
