program: Gaussian 09
title: 000035721
version: EM64L-G09RevD.01
frameworkgroup: C1[X(C7H16NO)]
method: RPBEPBE
basis: SDD
operation: Freq
keyword: #p
keyword: freq=noraman
keyword: PBEPBE/SDD
title: #p freq=noraman PBEPBE/SDD
converged: YES YES NO NO
title: Mulliken charges:
elementType: O N C C C C C C C H H H H H H H H H H H H H H H H
charge: -0.193429 -0.119087 -0.329167 -0.555096 -0.540133 -0.552196 -0.514256 0.253945 -0.755442 0.290928 0.287565 0.273706 0.266054 0.271140 0.273139 0.264551 0.272679 0.273406 0.268756 0.266091 0.256784 0.259217 0.247936 0.247520 0.285388
chargesum: 1.00000
title: Mulliken charges with hydrogens summed into heavy atoms:
elementType: O N C C C C C C C
charge: -0.193429 -0.119087 0.249326 0.255805 0.270236 0.256056 0.001745 0.253945 0.025402
polarizability: 9.48449092e+01 1.65952776e+00 8.06587137e+01 -4.92015826e-02 -9.23574359e-03 6.82747193e+01
1716.lowfreq: -48.0760 -8.0540 0.0007 0.0007 0.0007 6.6167 16.1107 28.1520 65.5199
frequency: -48.0148 27.9852 65.4563 95.3890 134.6512 194.0214 235.0478 262.4654 263.6593 296.9129 341.4120 385.5382 428.2093 462.2990 467.5528 489.0865 568.2121 727.6558 750.6142 814.6027 876.3832 904.8143 938.2786 947.3960 963.6656 1045.2734 1055.3121 1068.4835 1115.1107 1118.0364 1174.3003 1177.6074 1216.7595 1250.2905 1252.6760 1289.0563 1318.6970 1368.1858 1382.2685 1422.8177 1424.1322 1435.3978 1444.2484 1449.3983 1452.2659 1454.1606 1464.0526 1465.7237 1469.4923 1486.0205 1487.2575 1500.4798 1637.4448 2985.0220 2999.6711 3026.1944 3027.6428 3031.0550 3040.3900 3054.9877 3066.1427 3112.2926 3133.4828 3141.2950 3142.9386 3146.9276 3148.9108 3152.5403 3156.0430
redmass: 1.1821 3.4498 2.2324 1.5616 3.4386 1.1679 2.9466 1.0904 1.1670 2.7724 2.1864 2.5295 2.2868 2.6174 2.0781 2.9590 4.0778 4.3663 1.2638 3.4381 3.1086 1.9223 2.3382 1.6614 2.2111 1.1977 1.4628 2.1655 1.6425 1.5239 1.2979 2.2238 1.8317 1.8584 1.5951 1.7060 1.2168 1.2873 1.2321 1.1423 1.1414 1.0722 1.0963 1.1210 1.0486 1.0480 1.0959 1.0468 1.0853 1.0493 1.0531 1.0556 7.4835 1.0399 1.0590 1.0321 1.0324 1.0339 1.0592 1.1003 1.0966 1.1072 1.0991 1.1055 1.1059 1.1050 1.1054 1.1053 1.1048
irintensity: 2.3648 3.7495 0.0761 0.0794 5.5028 0.0252 4.2607 0.3492 1.7008 1.2596 0.1910 0.3161 0.1201 5.9879 0.4829 0.5903 11.4966 1.4688 7.9402 0.9376 52.7305 12.5624 12.3836 2.2002 4.4505 0.0472 2.8444 2.9112 2.2599 1.1776 0.2763 53.4682 15.8383 7.3936 0.2165 125.3092 1.4543 11.9651 67.0265 15.2791 17.2821 6.4494 7.4046 26.7233 28.1899 0.5783 2.6426 0.7970 7.7197 48.0266 43.0739 84.5001 100.5906 1.4942 4.3919 2.6040 2.5852 1.8352 3.1060 1.8184 7.9437 2.8283 2.8721 0.6851 1.0618 1.7727 7.9359 2.0572 7.1354
temp: 298.150 k
press: 1.00000 atm
elementType: 8 7 6 6 6 6 6 6 6 1 1 1 1 1 1 1 1 1 1 1 1 1 1 1 1
symmnumber: 1
zpe: 588752.9 jmol-1
zpe.correction: 0.224244 hartree
zpe.thermalcorrener: 0.235355 hartree
zpe.thermalcorrenthalpy: 0.236299 hartree
zpe.thermalcorrgfe: 0.187090 hartree
zpe.sumelectzpe: -405.304127 hartree
zpe.sumelectthermal: -405.293016 hartree
zpe.sumelectthermalent: -405.292072 hartree
zpe.sumelectthermalfe: -405.341280 hartree
dipole: 6.4689 -3.1745 0.0021
dipole: 7.2058
quadrupole: -29.3265 -52.3022 -47.8590
quadrupole: 8.3306 -0.0029 0.0068
quadrupole: 13.8360 -9.1397 -4.6964 8.3306 -0.0029 0.0068
hfenergy: -405.5283709 hartree
pointgroup: C01 [X(C7H16N1O1)]
dipole: -2.5564903 1.2253784 0.002663 debye
dipolederiv: -0.6557828 -0.0294622 0.0002692 0.0352425 -0.8023313 0.0030377 0.0020804 0.0030737 -0.2557004 -0.4372528 -0.0236243 -0.0000252 -0.0128714 -0.3218286 -0.0011687 -0.000572 -0.0017846 -0.3056915 0.5700349 -0.076859 -0.0060426 -0.0822283 0.0876299 0.0021082 -0.008421 0.0040807 0.0952706 0.0528806 -0.0292708 0.0429138 -0.0220785 0.136468 -0.1157209 0.0598953 -0.1147696 0.2264735 0.1474227 0.1199976 0.0044497 0.1798817 0.2484619 0.0091686 0.0084033 0.0082323 0.0638198 0.0508333 -0.0249217 -0.0421325 -0.0133455 0.1158661 0.1052277 -0.0614408 0.1055574 0.2501738 -0.6152462 0.1562319 0.0035521 0.2804778 -0.1435183 -0.0023499 0.0029788 -0.0039561 0.15871 1.3200461 0.0365552 -0.0035679 -0.0886943 0.9852372 -0.0041177 -0.0026907 -0.0036936 0.0775158 -0.4056818 -0.2020335 0.0016377 -0.2019865 -0.2410318 0.0011662 -0.0001817 -0.0007527 0.0186926 0.0652084 -0.0096148 0.0342518 -0.0228089 0.060487 0.05676 0.0242937 0.0664599 0.0073452 0.0561653 -0.0106904 -0.0356893 -0.0183002 0.0647856 -0.0531901 -0.0241495 -0.0650208 -0.0019303 0.1256724 0.0386862 0.0454166 0.0385811 0.0319082 -0.0813253 0.025211 -0.0267413 0.0220355 -0.0560696 0.0432272 -0.0021551 -0.0034517 0.1209985 0.0202197 0.0547847 0.0074515 0.0957403 0.0810247 -0.10534 -0.0142656 -0.0877293 0.0199644 0.0061052 -0.037641 -0.0296329 0.0764637 0.0995797 0.0250587 -0.0742705 -0.0113882 0.0747926 0.034267 -0.0422862 0.0754684 0.0102327 -0.0305073 0.0209532 0.0039071 0.0821721 0.0442305 -0.0065337 0.0068137 -0.0051029 0.1320505 0.1018176 0.0141199 0.073729 -0.016913 0.085442 -0.0258069 0.0376078 -0.0674177 -0.0050767 0.1273115 0.0418609 -0.0385198 0.0366912 0.0202731 0.0837099 -0.0186685 0.026779 0.034115 0.0772823 -0.1082754 0.0016106 -0.092698 0.0202503 -0.0129703 0.0276821 0.0234271 0.0792353 -0.0532132 0.0459052 0.0048945 0.0057142 0.1224525 -0.0180787 -0.055124 -0.0039209 0.0922726 0.0957578 0.0120354 0.0075141 -0.0420897 0.0282769 -0.0689956 0.027631 -0.0838634 -0.0094882 0.0937552 0.0098311 -0.0074887 -0.0443911 0.0253568 0.068559 -0.0272889 0.0843402 -0.0060611 0.1032348 0.0107006 0.0635883 0.0142743 0.0821347 -0.0821203 0.0178609 -0.0979707 0.0025504 0.1011946 0.012219 -0.0647824 0.0157794 0.0813054 0.0824054 -0.0183374 0.0992325 0.0033088 -0.0154681 0.0327098 0.0012053 0.0721601 0.0523886 -0.0003567 0.001559 0.0005244 0.1379424 unknown
polarizability: 94.8129415|1.7901965|80.6901381|-0.0670451|-0.0803874|68.2752626 unknown
InChI: InChI=1S/C7H16NO/c1-7(9)5-6-8(2,3)4/h5-6H2,1-4H3
charge 1 multiplicity 1
25 atoms
O  2.244816 -1.358781 0.003583
N  -1.752832 0.049712 0.009356
C  -0.29461 -0.472552 -0.021344
C  -2.040234 0.941666 -1.1968
C  -2.679783 -1.16892 -0.043582
C  -2.029244 0.823113 1.297245
C  0.801346 0.601915 -0.00682
C  2.187369 -0.102926 -0.0062
C  3.408523 0.789436 -0.015549
H  -0.181679 -1.142815 0.847075
H  -0.203872 -1.095264 -0.927135
H  -1.780675 0.396504 -2.117118
H  -3.111006 1.197317 -1.20425
H  -1.444181 1.862468 -1.12496
H  -2.46491 -1.820407 0.816877
H  -3.726118 -0.829869 -0.005363
H  -2.497562 -1.718483 -0.979457
H  -1.792333 0.181049 2.159309
H  -1.409674 1.730616 1.323191
H  -3.093222 1.104477 1.322706
H  0.756138 1.249939 0.889179
H  0.761457 1.266747 -0.890183
H  3.421715 1.448393 0.873761
H  3.408516 1.450934 -0.902791
H  4.323057 0.178333 -0.022231
