program: Gaussian 09
title: 000037316
version: EM64L-G09RevD.01
frameworkgroup: C1[X(C13H23N5)]
method: RPBEPBE
basis: SDD
operation: Freq
keyword: #pfreq=noraman
keyword: PBEPBE/SDD
title: #p freq=noraman PBEPBE/SDD
converged: YES YES NO NO
title: Mulliken charges:
elementType: N N N N N C C C C C C C C C C C C C H H H H H H H H H H H H H H H H H H H H H H H
charge: 0.034111 -0.139483 -0.415970 -0.123166 -0.646468 -0.389332 -0.390641 -0.377048 -0.385917 -0.388836 -0.393019 -0.500411 -0.518805 -0.503366 -0.522213 0.135693 0.170033 0.248053 0.189082 0.212868 0.206393 0.207249 0.204413 0.206235 0.185113 0.206160 0.200272 0.203715 0.206204 0.201085 0.200004 0.244266 0.196532 0.224735 0.199975 0.221154 0.285251 0.197195 0.270601 0.290322 0.347962
chargesum: 0.00000
title: Mulliken charges with hydrogens summed into heavy atoms:
elementType: N N N N N C C C C C C C C C C C C C
charge: 0.034111 -0.139483 -0.145368 -0.123166 -0.008185 0.012618 0.023001 0.033599 0.005357 0.015151 0.014269 -0.056141 -0.097539 -0.082237 -0.039767 0.135693 0.170033 0.248053
polarizability: 3.04851588e+02 -6.36287511e+00 1.79701817e+02 -3.61144424e-01 6.71873419e+00 1.22204321e+02
1716.lowfreq: -13.9934 -8.8790 -3.5881 -0.0005 0.0002 0.0005 16.8403 25.7495 37.1336
frequency: 15.2281 24.9897 37.0744 53.3423 60.8325 102.7602 122.7974 139.4778 186.8850 199.1258 210.6353 253.5366 292.7410 305.6530 319.7997 358.6826 373.5230 383.0099 403.7741 415.0407 431.7314 450.0209 464.7585 473.6811 499.7483 522.9679 570.3513 609.8513 618.7701 648.6034 675.8951 725.8370 767.6430 775.4526 777.8657 793.3012 838.6926 843.1263 849.4665 855.6008 878.6159 903.8995 908.2498 917.9304 925.2987 976.7307 979.2807 1011.3205 1033.5184 1035.5145 1071.2556 1076.2457 1082.3718 1090.3186 1095.6696 1097.0709 1108.4706 1124.5917 1128.2766 1131.8755 1218.1346 1224.9681 1241.6892 1243.7319 1250.6973 1253.6860 1271.5044 1275.6123 1303.7631 1305.3409 1312.9442 1318.5661 1333.5083 1337.3036 1338.1980 1339.9183 1341.5214 1349.0713 1360.9885 1448.6569 1450.8611 1458.0986 1459.8992 1462.5398 1464.0129 1466.1715 1468.9169 1474.1670 1475.4202 1511.2404 1544.3090 1599.9896 1613.5340 1616.4246 2951.5199 2953.6186 2959.2201 2962.2183 2962.3157 2966.9492 2974.2531 2977.5777 2977.7372 2979.1677 3019.7054 3025.1576 3031.7388 3033.3329 3038.6563 3042.8265 3047.7297 3056.0451 3073.5662 3079.0884 3425.9311 3454.0617 3636.9908
redmass: 3.3378 3.2775 4.2178 3.8128 3.3032 4.7073 3.7972 3.6453 3.3152 2.3121 2.6954 2.8172 2.1614 2.0894 3.1403 2.1605 1.7512 2.3092 1.9773 2.5065 2.4601 1.7216 2.8924 2.4206 3.9725 1.6597 3.2449 3.7360 2.8838 3.1073 3.1172 1.5790 3.2131 1.5297 1.5924 3.5650 2.7516 2.2201 1.4938 1.5784 3.9190 2.4174 1.9066 1.4010 1.9167 2.7188 2.7331 3.1914 1.9236 1.9250 2.0200 1.2938 1.1526 1.6044 1.6944 1.6212 2.1673 2.2081 1.6998 1.8391 1.3805 1.4003 1.3852 1.4387 1.3515 1.3409 1.5617 1.5251 1.4014 1.4798 1.4390 1.4537 1.5620 1.5076 1.5560 1.5005 1.5186 1.5153 1.9338 1.0930 1.1052 1.0877 1.1116 1.0903 1.0899 1.0826 1.0883 1.0951 1.0942 2.7864 1.5441 2.4232 7.1797 5.7655 1.0659 1.0674 1.0672 1.0618 1.0614 1.0631 1.0615 1.0616 1.0629 1.0610 1.0973 1.0962 1.0958 1.1020 1.1028 1.1024 1.1037 1.0960 1.0940 1.0932 1.0737 1.0482 1.0975
irintensity: 1.4764 0.1247 0.3328 3.7360 0.2231 7.8703 1.4410 2.4293 0.8964 3.1773 3.4585 0.9423 1.4624 3.6833 19.0531 25.0447 80.3725 2.8463 60.6794 2.0625 12.5034 40.0735 7.0636 0.8122 1.2991 67.0661 7.3698 17.5575 55.9962 0.2904 8.9877 148.0058 2.3000 3.4897 0.5544 4.0392 3.7394 15.8334 2.4725 6.0657 9.1378 11.7086 3.3829 7.3588 5.9137 4.1934 5.7725 132.2777 2.1495 22.4110 2.5920 2.1703 3.0879 24.2809 9.3752 1.3177 25.8940 56.4457 18.7218 32.5524 42.9439 34.9577 6.6836 11.2894 13.4416 6.3282 5.7491 1.3782 12.3719 8.8075 6.2921 2.1899 21.9641 1.0423 3.3478 4.4629 1.5480 6.8109 28.1715 9.9383 14.9057 6.9051 10.2676 9.0667 11.5969 15.5418 25.5689 6.7885 3.9692 563.1183 140.6094 181.7380 194.3674 378.2470 26.2988 26.0731 35.5927 38.0325 45.1886 38.8321 45.4358 35.3316 31.7997 41.3949 57.5116 91.3777 78.8881 47.6636 27.1308 83.3620 97.8069 40.6805 19.3614 6.6239 18.0627 58.8485 34.4701
temp: 298.150 k
press: 1.00000 atm
elementType: 7 7 7 7 7 6 6 6 6 6 6 6 6 6 6 6 6 6 1 1 1 1 1 1 1 1 1 1 1 1 1 1 1 1 1 1 1 1 1 1 1
symmnumber: 1
zpe: 931852.5 jmol-1
zpe.correction: 0.354924 hartree
zpe.thermalcorrener: 0.373068 hartree
zpe.thermalcorrenthalpy: 0.374012 hartree
zpe.thermalcorrgfe: 0.306530 hartree
zpe.sumelectzpe: -781.482012 hartree
zpe.sumelectthermal: -781.463868 hartree
zpe.sumelectthermalent: -781.462924 hartree
zpe.sumelectthermalfe: -781.530406 hartree
dipole: -3.0484 1.7853 0.6138
dipole: 3.5857
quadrupole: -88.0738 -99.7696 -109.3232
quadrupole: -4.8742 0.7451 3.7944
quadrupole: 10.9817 -0.7140 -10.2676 -4.8742 0.7451 3.7944
hfenergy: -781.8369363 hartree
pointgroup: C01 [X(C13H23N5)]
dipole: -1.1788313 0.6435454 0.431623 debye
polarizability: 304.4309496|-7.4668877|173.6949797|-6.3820572|19.3052775|128.6317974 unknown
InChI: InChI=1S/C13H23N5/c14-13(17-15-11-7-3-1-4-8-11)18-16-12-9-5-2-6-10-12/h17H,1-10,14H2
charge 0 multiplicity 1
41 atoms
N  -1.773754 -0.024311 0.069544
N  2.319718 1.037968 0.305879
N  -1.278202 1.230453 0.397356
N  0.984605 0.598598 -0.014505
N  0.43775 2.660026 1.110667
C  -5.844653 -0.939658 0.4090
C  -4.707182 -1.98772 0.438879
C  -5.319521 0.469459 0.77148
C  5.397266 -1.759466 -0.166777
C  5.503956 -0.504004 0.731281
C  3.918924 -2.148743 -0.405619
C  -3.538526 -1.571466 -0.496972
C  -4.151396 0.898843 -0.165053
C  4.713938 0.688683 0.121061
C  3.102268 -0.972602 -1.014188
C  -3.059354 -0.166501 -0.182042
C  3.283731 0.289245 -0.188845
C  0.1030 1.454177 0.498896
H  -6.291052 -0.912558 -0.607068
H  -6.653884 -1.230682 1.106093
H  -5.091347 -2.98065 0.13627
H  -4.324182 -2.088049 1.474166
H  -4.959838 0.467207 1.819873
H  -6.13667 1.213577 0.70718
H  5.884414 -1.552871 -1.142927
H  5.94565 -2.605185 0.292379
H  6.563703 -0.215676 0.872536
H  5.091677 -0.735023 1.734212
H  3.457867 -2.444247 0.558077
H  3.855066 -3.026988 -1.076766
H  -3.899703 -1.608972 -1.547285
H  -2.685989 -2.266156 -0.410854
H  -3.789282 1.900265 0.139138
H  -4.547762 1.010448 -1.195934
H  5.218259 0.99334 -0.821287
H  4.714189 1.560629 0.799061
H  2.028208 -1.211861 -1.079593
H  3.473136 -0.779635 -2.04357
H  -1.881433 2.06235 0.407338
H  -0.161247 3.06885 1.825082
H  1.453854 2.791708 1.164136
