program: Gaussian 09
title: 000037289
version: EM64L-G09RevD.01
frameworkgroup: C1[X(C12H24O3)]
method: RPBEPBE
basis: SDD
operation: Freq
keyword: #pfreq=noraman
keyword: PBEPBE/SDD
title: #p freq=noraman PBEPBE/SDD
converged: YES YES NO NO
title: Mulliken charges:
elementType: O O O C C C C C C C C C C C C H H H H H H H H H H H H H H H H H H H H H H H H
charge: -0.460600 -0.418374 -0.232178 -0.054909 -0.476344 -0.366492 -0.421152 -0.365630 -0.364268 -0.353939 -0.376019 -0.354820 -0.488454 -0.695979 0.170386 0.187154 0.204365 0.199614 0.210318 0.209983 0.196072 0.227075 0.183554 0.186345 0.174256 0.233886 0.189032 0.188174 0.210990 0.219742 0.194276 0.193463 0.250542 0.255594 0.334717 0.210147 0.214945 0.210259 0.374270
chargesum: 0.00000
title: Mulliken charges with hydrogens summed into heavy atoms:
elementType: O O O C C C C C C C C C C C C
charge: -0.125883 -0.044104 -0.232178 0.132245 -0.072365 0.053809 0.001995 0.004269 0.043874 0.023268 0.054713 0.032919 0.017682 -0.060629 0.170386
polarizability: 1.75911261e+02 -1.60966532e+00 1.33988605e+02 -1.70707774e+00 1.88489117e+00 1.12335338e+02
1716.lowfreq: -11.4228 -4.9361 -0.0006 -0.0002 0.0010 4.0735 17.6679 23.5087 31.3528
frequency: 17.5839 23.3622 31.2467 45.4804 47.3877 63.6494 74.9690 100.6352 104.6970 119.9766 133.5059 137.4385 166.7610 171.2798 227.8676 231.8987 275.8214 310.0033 314.9453 377.8278 391.7158 424.3921 446.7686 496.1626 501.0477 585.4664 635.0963 639.3148 724.2269 727.4060 741.2340 770.2241 783.2377 828.8124 856.6891 872.1139 882.8217 905.8599 952.0607 982.3264 1001.4521 1008.2748 1027.8068 1039.5387 1059.3399 1068.5800 1078.6502 1080.3924 1090.2850 1096.8242 1116.0026 1121.3950 1145.4009 1193.3981 1215.5239 1222.6266 1231.4518 1244.1984 1252.2625 1261.8600 1278.9072 1279.2933 1284.2979 1288.6720 1291.2030 1297.6405 1303.2883 1319.2344 1339.1553 1353.2140 1354.8232 1367.6003 1371.8057 1388.7348 1398.1264 1436.5403 1447.0586 1456.3555 1462.9347 1465.1764 1466.3607 1474.2307 1476.8389 1482.0411 1483.1129 1488.3553 1668.9230 2911.9321 2945.1728 2949.3327 2954.9167 2958.0462 2966.4831 2971.8514 2973.6741 2976.6360 2985.0392 2985.2641 2993.0465 2996.6550 3003.1170 3019.9917 3027.1272 3029.3042 3044.7827 3045.6968 3064.1323 3068.3318 3070.7086 3511.3740 3558.8866
redmass: 9.0833 4.9791 2.2336 2.6198 2.3663 2.2788 3.5162 3.0578 2.5560 1.8430 2.4381 2.3344 2.9341 5.3188 1.1519 3.1332 3.3971 1.3012 2.4971 3.0135 3.0439 3.1118 3.0536 3.0217 1.7887 4.6847 3.5706 1.3161 1.0707 1.1271 1.1170 1.5395 1.2241 2.3264 4.1643 1.3608 1.9083 1.6667 1.8047 1.5880 2.6611 3.2121 1.9998 3.7105 2.6687 1.8793 2.2585 2.1036 2.1431 1.7830 1.5472 2.5719 1.5359 1.6271 1.2823 1.3693 1.3609 1.3233 1.3672 1.2704 1.1724 1.3262 1.1004 1.0930 1.1017 1.1397 1.3628 1.4384 1.4085 1.5833 1.6044 1.5306 1.8398 1.2173 1.6567 1.0844 1.0839 1.0912 1.0671 1.0757 1.0752 1.0711 1.0433 1.0986 1.0811 1.0908 8.2015 1.0807 1.0623 1.0622 1.0589 1.0644 1.0591 1.0367 1.0599 1.0609 1.0615 1.0972 1.0607 1.0958 1.1014 1.0927 1.1040 1.0983 1.1039 1.1023 1.1031 1.1006 1.0993 1.0639 1.0660
irintensity: 1.0697 0.0540 0.3781 0.1819 0.2476 0.8481 0.6181 0.8171 0.4033 0.1884 0.6353 0.9992 1.3547 1.8942 0.0593 1.7646 6.3474 125.0907 35.0302 6.6987 23.1786 1.9015 8.9870 18.5829 27.8380 14.0634 2.3298 126.6327 13.8279 8.2966 0.7910 12.9888 1.9084 11.6969 2.2668 0.5703 2.3503 2.5622 16.6568 13.1827 31.7662 82.0118 78.3344 70.1920 3.2063 18.4432 19.9814 15.7732 31.6650 15.7201 10.6749 7.4023 6.5921 3.8761 10.4061 13.9125 18.1289 0.6927 15.4594 9.2117 8.0264 16.9419 0.5038 2.2628 1.5308 2.0275 8.5534 11.2604 1.7501 13.6249 3.2099 0.6308 25.7991 10.9003 22.3738 29.5368 0.7745 1.5471 0.0783 0.3354 0.4588 1.8744 12.1059 18.7312 0.5804 24.3397 205.7006 52.9872 8.8555 46.5991 9.6769 35.9922 62.0969 33.5112 54.0299 48.3268 4.8565 2.8601 35.5067 18.8810 1.1756 7.0864 11.6539 3.9714 111.9496 5.3634 88.2459 95.8944 56.0111 17.1211 4.4704
temp: 298.150 k
press: 1.00000 atm
elementType: 8 8 8 6 6 6 6 6 6 6 6 6 6 6 6 1 1 1 1 1 1 1 1 1 1 1 1 1 1 1 1 1 1 1 1 1 1 1 1
symmnumber: 1
zpe: 899675.5 jmol-1
zpe.correction: 0.342668 hartree
zpe.thermalcorrener: 0.362105 hartree
zpe.thermalcorrenthalpy: 0.363049 hartree
zpe.thermalcorrgfe: 0.290638 hartree
zpe.sumelectzpe: -696.107905 hartree
zpe.sumelectthermal: -696.088469 hartree
zpe.sumelectthermalent: -696.087524 hartree
zpe.sumelectthermalfe: -696.159936 hartree
dipole: 1.0579 2.2904 -0.8408
dipole: 2.6594
quadrupole: -88.7084 -95.2606 -94.7965
quadrupole: 0.6086 -0.2514 -2.1605
quadrupole: 4.2135 -2.3388 -1.8747 0.6086 -0.2514 -2.1605
hfenergy: -696.4505737 hartree
pointgroup: C01 [X(C12H24O3)]
dipole: 0.4357974 -0.8969277 0.31668 debye
polarizability: 175.8229236|2.4922354|134.0129964|1.6814217|2.2585971|112.3992844 unknown
InChI: InChI=1S/C12H24O3/c1-2-3-4-5-8-11(13)9-6-7-10-12(14)15/h11,13-14H,2-10H2,1H3
charge 0 multiplicity 1
39 atoms
O  0.359944 -2.168422 -1.274638
O  -6.734681 0.568834 -0.326061
O  -5.149925 2.146661 0.294283
C  0.376006 -1.859614 0.176997
C  1.816706 -1.597344 0.674141
C  2.516188 -0.376029 0.03653
C  -0.582677 -0.672434 0.360585
C  4.010936 -0.280569 0.415345
C  -2.050955 -1.033532 0.049268
C  4.719944 0.944368 -0.205226
C  -2.999153 0.177623 0.178139
C  6.215728 1.042907 0.172455
C  -4.457645 -0.196772 -0.145865
C  6.916717 2.266591 -0.456385
C  -5.419048 0.968088 -0.024947
H  -0.027835 -2.736849 0.734849
H  1.789214 -1.47807 1.777283
H  2.427856 -2.506375 0.480173
H  2.412751 -0.434808 -1.065476
H  2.005154 0.556072 0.350729
H  -0.495493 -0.302695 1.402446
H  -0.256528 0.148249 -0.306453
H  4.531757 -1.206351 0.090487
H  4.112056 -0.240316 1.520782
H  -2.384083 -1.840672 0.736357
H  -2.097426 -1.449664 -0.975374
H  4.623207 0.902783 -1.310366
H  4.200654 1.871571 0.116134
H  -2.945855 0.597073 1.201562
H  -2.668954 0.986903 -0.501024
H  6.309977 1.087937 1.276841
H  6.733784 0.114905 -0.145617
H  -4.819916 -1.00428 0.520933
H  -4.543582 -0.602672 -1.173205
H  0.967271 -2.933524 -1.440443
H  6.860967 2.23009 -1.560891
H  7.984416 2.313696 -0.173103
H  6.438145 3.208915 -0.128887
H  -7.33902 1.355625 -0.238856
