program: Gaussian 09
title: 000037335
version: EM64L-G09RevD.01
frameworkgroup: C1[X(C16H20N2O2)]
method: RPBEPBE
basis: SDD
operation: Freq
keyword: #p
keyword: freq=noraman
keyword: PBEPBE/SDD
title: #p freq=noraman PBEPBE/SDD
converged: YES YES NO NO
title: Mulliken charges:
elementType: O O N N C C C C C C C C C C C C C C C C H H H H H H H H H H H H H H H H H H H H
charge: -0.268938 -0.463935 -0.120997 -0.528140 -0.073113 -0.528414 -0.310611 0.292294 0.259576 0.122040 0.437266 -0.389154 -0.369501 -0.458734 -0.425478 -0.240767 -0.662754 -0.652795 -0.239561 -0.240173 0.204533 0.240476 0.216043 0.233329 0.188613 0.246272 0.273969 0.233983 0.398354 0.234365 0.219123 0.246571 0.237114 0.245927 0.237080 0.236098 0.263709 0.225481 0.223158 0.257688
chargesum: 0.00000
title: Mulliken charges with hydrogens summed into heavy atoms:
elementType: O O N N C C C C C C C C C C C C C C C C
charge: -0.268938 -0.065580 -0.120997 -0.270452 0.131420 -0.071895 0.111330 0.292294 0.259576 0.122040 0.437266 -0.142882 -0.095533 -0.224751 -0.191112 -0.021644 0.066860 0.084092 -0.014079 -0.017015
polarizability: 2.72674134e+02 -1.32654703e+01 2.18641068e+02 -1.82560850e+00 4.01150957e+00 1.13809622e+02
1716.lowfreq: -6.9775 -3.8461 -0.0005 0.0001 0.0008 5.6105 14.9964 26.8190 35.4695
frequency: 14.2898 26.7279 35.3168 52.6124 55.1124 89.1833 99.0274 125.6411 146.4211 158.0627 176.4750 184.1157 206.3586 228.5739 257.4263 266.5841 309.6008 341.9143 406.7148 420.4919 429.1840 447.2010 468.6885 474.3002 481.6404 513.7337 528.6927 568.4675 574.1362 588.2980 624.9794 643.6735 720.4009 739.5067 756.4299 778.9776 781.7444 785.1611 806.0058 849.3625 859.5143 867.6550 890.3331 895.7456 918.2457 941.7540 959.4220 963.6048 973.6081 994.3757 1022.4602 1040.5187 1050.0665 1062.7195 1071.2178 1087.0968 1089.6727 1093.4897 1099.2429 1131.0045 1147.1986 1170.2605 1186.3257 1194.2265 1202.4875 1231.0990 1233.3915 1240.9701 1254.8840 1269.6447 1276.2702 1310.8730 1342.2213 1363.2228 1381.0050 1403.6780 1405.1996 1425.3425 1428.2496 1434.9727 1439.1123 1449.0028 1460.4328 1462.6026 1471.3464 1473.8418 1482.0720 1489.0528 1495.8256 1517.3019 1583.6710 1591.5786 1596.5232 1635.0003 2937.5882 2945.8204 2953.9611 2960.1663 2966.2964 2968.4008 3026.7179 3029.2019 3031.6082 3034.3322 3102.0561 3118.6829 3124.4819 3131.8354 3134.0851 3146.7367 3152.8832 3169.8867 3173.8615 3412.8579
redmass: 4.5247 4.6129 3.3698 1.6918 2.8143 4.5821 2.7956 2.0343 4.7603 3.4051 1.6784 3.7583 2.9592 2.2638 3.8439 4.2211 4.3993 3.6360 3.7349 3.1028 2.9629 3.2300 3.7624 3.4903 3.3925 3.0234 5.2656 3.5539 3.2472 3.5580 4.8971 3.2300 6.0015 1.3139 1.3908 4.5149 1.5807 4.9816 2.0160 4.6548 1.6292 2.3221 1.5876 1.2808 2.3864 1.8913 1.3436 4.2754 1.3877 1.3270 2.5418 2.5940 1.5642 2.6702 1.8777 2.5943 2.8138 1.2372 1.7557 1.3596 1.4182 1.0764 1.2731 1.4811 1.2988 1.4715 1.3702 2.1262 2.2038 1.8295 1.8823 1.3745 1.2105 1.4495 1.9887 2.6353 2.4633 1.1262 5.9711 1.1451 2.3138 1.6817 1.3943 1.3972 1.0650 1.4009 1.0601 1.1120 1.1479 3.9570 6.7901 4.3389 5.8174 6.9730 1.0759 1.0628 1.0385 1.0598 1.0479 1.0592 1.1019 1.1019 1.0992 1.1001 1.0968 1.0857 1.0858 1.0936 1.0904 1.0947 1.0963 1.0948 1.0969 1.0759
irintensity: 3.1538 1.1871 0.5187 0.9706 0.1833 4.8978 1.5787 0.3410 4.2221 0.9595 1.3243 0.8235 1.6738 6.0495 0.5854 0.1549 7.1767 1.9417 29.8967 6.8114 0.6499 10.1367 5.3102 1.5778 6.8277 3.2526 8.0655 9.4370 9.9492 17.0112 2.4895 1.1658 21.5670 1.3429 63.5411 5.1218 91.5155 2.3978 57.6513 5.6667 6.9895 32.9209 21.2570 119.5363 17.8656 97.6003 1.0300 11.8895 5.5195 0.1311 26.0521 5.4038 58.7042 53.3985 51.4543 47.5408 32.3263 0.6031 12.6644 1.2861 7.3853 2.2239 12.6339 51.3749 53.7223 30.2574 4.1700 143.8710 1.4486 42.9690 23.5265 40.6317 39.9850 66.7336 10.5489 127.2532 28.2618 16.5953 41.0075 7.2699 7.6854 42.9119 1.0171 5.0054 27.1156 278.5969 6.0285 6.3540 60.3730 34.7454 92.4063 145.3764 2.3645 4.3115 236.3250 34.7940 52.8468 481.3881 86.9622 50.9496 3.1118 41.1158 14.7055 67.6817 14.1074 1.4060 1.7792 14.7112 18.8961 37.0357 36.9366 23.3043 10.4035 23.9976
temp: 298.150 k
press: 1.00000 atm
elementType: 8 8 7 7 6 6 6 6 6 6 6 6 6 6 6 6 6 6 6 6 1 1 1 1 1 1 1 1 1 1 1 1 1 1 1 1 1 1 1 1
symmnumber: 1
zpe: 865757.4 jmol-1
zpe.correction: 0.329750 hartree
zpe.thermalcorrener: 0.349192 hartree
zpe.thermalcorrenthalpy: 0.350136 hartree
zpe.thermalcorrgfe: 0.279229 hartree
zpe.sumelectzpe: -880.149533 hartree
zpe.sumelectthermal: -880.130091 hartree
zpe.sumelectthermalent: -880.129147 hartree
zpe.sumelectthermalfe: -880.200054 hartree
dipole: -7.2896 2.7358 -3.4369
dipole: 8.5109
quadrupole: -69.0321 -109.0867 -128.9624
quadrupole: -3.6445 8.2468 2.7047
quadrupole: 33.3283 -6.7263 -26.6020 -3.6445 8.2468 2.7047
hfenergy: -880.4792829 hartree
pointgroup: C01 [X(C16H20N2O2)]
dipole: -2.7463063 0.3461721 1.8841749 debye
polarizability: 271.2561418|5.1574935|163.1471615|-16.1822002|-52.8151037|170.7215208 unknown
InChI: InChI=1S/C16H20N2O2/c1-18(2)16(17)10-13(19)11-20-15-9-5-7-12-6-3-4-8-14(12)15/h3-9,13,17,19H,10-11H2,1-2H3
charge 0 multiplicity 1
40 atoms
O  0.61868 0.036832 -0.155472
O  -2.014754 -0.647932 -1.57885
N  -5.45062 0.533048 0.790895
N  -4.305315 0.565469 -1.327184
C  -1.799011 -0.010935 -0.291112
C  -3.043366 -0.165779 0.634339
C  -0.572967 -0.654619 0.359117
C  -4.332744 0.339845 -0.020533
C  1.87209 -0.416029 0.270354
C  2.996487 0.29822 -0.289416
C  4.331601 -0.09004 0.111064
C  2.069646 -1.469996 1.173299
C  2.822377 1.368532 -1.223911
C  4.507933 -1.170148 1.040797
C  5.446975 0.622355 -0.442066
C  3.397695 -1.84051 1.552652
C  -6.685351 1.058749 0.184145
C  -5.538694 0.133743 2.205762
C  3.931676 2.041461 -1.745086
C  5.25445 1.667012 -1.349752
H  -1.598623 1.077388 -0.41288
H  -3.171493 -1.236478 0.897102
H  -2.854882 0.390197 1.573421
H  -0.539628 -1.726978 0.083417
H  -0.600087 -0.551778 1.465489
H  1.223883 -2.020765 1.593604
H  1.805958 1.638519 -1.523671
H  5.522273 -1.459674 1.337743
H  -2.89021 -0.212269 -1.891984
H  6.459741 0.329742 -0.139461
H  3.532008 -2.667958 2.258429
H  -6.491202 2.004049 -0.357758
H  -7.416717 1.270225 0.980066
H  -7.142367 0.335933 -0.522334
H  -6.349616 -0.606705 2.352027
H  -5.746378 1.00753 2.853865
H  -4.601477 -0.328883 2.543271
H  3.790665 2.85751 -2.462453
H  6.116485 2.201398 -1.764926
H  -5.187223 0.885919 -1.759811
