program: Gaussian 09
title: 000037208
version: EM64L-G09RevD.01
frameworkgroup: C1[X(C9H9Cl2NO2)]
method: RPBEPBE
basis: SDD
operation: Freq
keyword: #p
keyword: freq=noraman
keyword: PBEPBE/SDD
title: #p freq=noraman PBEPBE/SDD
converged: YES YES NO NO
title: Mulliken charges:
elementType: Cl Cl O O N C C C C C C C C C H H H H H H H H H
charge: 0.015143 0.048550 -0.383181 -0.278701 -0.382529 -0.050076 0.271898 0.186587 -0.575794 -0.342865 -0.336391 -0.220210 -0.237787 -0.222462 0.284529 0.326143 0.338078 0.277269 0.211716 0.236138 0.234249 0.236348 0.363347
chargesum: 0.00000
title: Mulliken charges with hydrogens summed into heavy atoms:
elementType: Cl Cl O O N C C C C C C C C C
charge: 0.015143 0.048550 -0.019834 -0.278701 -0.056386 0.234453 0.271898 0.186587 -0.237717 -0.065597 -0.124675 0.015928 -0.003537 0.013887
polarizability: 1.87459201e+02 -1.14562810e+01 1.31980643e+02 1.09576645e+01 1.05989135e+01 7.05063766e+01
1716.lowfreq: -4.3269 -0.0016 -0.0012 0.0011 1.9464 10.6270 21.7631 39.5503 43.0660
frequency: 21.5853 39.4923 43.0410 56.7767 114.3997 153.2402 182.0659 194.3526 213.3350 267.1689 280.6121 289.8533 381.4383 398.1525 408.3974 468.6102 530.3539 548.7732 613.6800 640.1467 658.9889 684.6072 690.8443 702.7172 726.3129 797.5169 835.6822 854.0737 938.2928 949.0053 987.9597 989.5553 1009.8410 1013.9329 1026.4493 1062.3426 1088.7169 1136.1120 1175.0303 1183.0643 1195.4465 1205.0569 1251.1125 1266.2602 1320.4702 1325.7630 1386.7837 1392.7643 1431.9031 1458.8709 1489.4174 1569.5527 1605.8778 1611.1679 3013.0755 3121.5210 3135.2290 3136.7978 3148.4752 3161.3789 3172.2974 3545.7632 3580.6187
redmass: 4.4833 8.7486 9.9819 7.7635 6.2418 5.7121 8.9860 9.7356 8.0352 1.1080 13.3249 6.9617 4.2257 3.1399 5.2348 3.8117 3.9408 6.4785 6.3472 1.5747 4.9469 5.0969 5.1710 1.5165 6.9149 2.4244 6.8453 1.2547 1.4412 3.2973 1.6234 3.6919 1.3538 4.6895 2.5000 2.8971 1.7005 3.4015 1.0595 1.0605 1.1322 1.1237 1.9057 1.2483 1.3247 1.6668 8.9006 1.3954 2.1842 1.8648 2.2345 6.3790 6.4343 6.0267 1.0840 1.0875 1.0871 1.0891 1.0920 1.0957 1.1008 1.0771 1.0667
irintensity: 0.9184 0.4952 3.6441 7.5520 0.7629 0.5242 2.1173 1.8976 1.0924 146.0368 8.3067 11.4723 2.4426 0.2082 0.7651 2.7438 40.3426 37.2757 0.9528 144.6059 14.4014 7.7675 25.9363 140.0745 108.1762 20.6849 14.0569 0.9951 3.3379 29.5411 3.5637 4.0199 6.6755 122.7005 72.5119 24.5878 20.5216 50.3677 1.1560 10.3591 11.3179 9.4415 61.3542 46.9106 1.0649 180.9333 1.8728 6.5790 20.7112 330.7402 125.9951 97.6877 57.4876 10.3895 22.4650 11.6146 1.8623 2.6483 19.2426 12.8669 19.3888 22.8311 21.2925
temp: 298.150 k
press: 1.00000 atm
elementType: 17 17 8 8 7 6 6 6 6 6 6 6 6 6 1 1 1 1 1 1 1 1 1
symmnumber: 1
zpe: 435931.9 jmol-1
zpe.correction: 0.166038 hartree
zpe.thermalcorrener: 0.179852 hartree
zpe.thermalcorrenthalpy: 0.180796 hartree
zpe.thermalcorrgfe: 0.122506 hartree
zpe.sumelectzpe: -1472.650769 hartree
zpe.sumelectthermal: -1472.636955 hartree
zpe.sumelectthermalent: -1472.636011 hartree
zpe.sumelectthermalfe: -1472.694301 hartree
dipole: -4.0184 1.2849 -0.0078
dipole: 4.2189
quadrupole: -93.0727 -97.2843 -93.5668
quadrupole: -7.9951 0.0181 -0.0201
quadrupole: 1.5685 -2.6430 1.0745 -7.9951 0.0181 -0.0201
hfenergy: -1472.8168072 hartree
pointgroup: C01 [X(C9H9Cl2N1O2)]
dipole: -1.6071424 0.3882731 -0.1461383 debye
dipolederiv: -0.271327 0.052169 0.0171304 0.0539122 -0.6013496 0.1988045 0.0530755 0.1596109 -0.1942912 -0.7699696 0.2099498 -0.0376606 0.1968565 -0.2306576 0.0507456 -0.0237006 0.070649 -0.1292992 -0.7316145 0.0719343 -0.18289 0.0056214 -0.3319506 -0.2979815 -0.3808876 -0.2190572 -0.6935795 -0.8267096 0.1458113 -0.065651 -0.1122676 -0.8998577 0.1732616 0.0048199 0.1706956 -0.399014 -1.8268884 -0.3953523 -0.0562416 -0.3515457 -0.4913713 -0.0145571 0.2180421 -0.0144019 -0.5764152 1.1757677 0.1720053 0.2150752 -0.2543429 0.0470428 0.3034271 0.2605794 0.2218448 0.794134 -0.5252877 0.0801017 -0.0762171 0.1469819 -0.0710674 0.0474211 -0.1092097 0.0342832 -0.0204031 2.0375816 0.1135456 0.0958482 0.5497926 1.129909 -0.2639751 0.0024705 -0.2523543 0.2795125 1.0209973 -0.2796656 0.0411835 -0.2964474 0.9577447 -0.2655268 -0.0614722 -0.297948 0.2875825 0.0038399 -0.1040059 0.026913 0.0925635 0.0369492 0.0056449 -0.0196797 -0.0335011 -0.1067724 0.0358596 0.0677608 0.0414751 -0.0771732 -0.0012006 -0.0072214 0.0984408 0.0056857 -0.1235597 0.0121139 0.1721129 0.0235922 0.1744343 -0.0051945 0.0227681 0.0216765 0.0240925 -0.1480413 -0.2100141 -0.0512457 -0.0048461 -0.1157239 0.1271779 -0.0242387 -0.0018788 -0.0179727 -0.1450796 0.1092445 -0.0465242 0.0493153 0.0019843 -0.0013326 -0.0078581 0.0450467 -0.0135787 -0.1294491 0.138051 -0.0451222 0.0039655 0.1225376 0.0196925 -0.0618422 0.0076652 0.0302443 0.0128291 0.2803787 0.0083414 -0.0351469 0.0637309 0.1348106 0.0493466 -0.10815 0.0349836 0.3175454 -0.0162993 -0.0077052 -0.0512807 0.0025353 -0.0427465 -0.0120771 -0.0254236 0.0063226 0.0023585 0.1438623 0.049312 -0.0074035 0.0147406 0.0027876 0.0051392 0.0128769 0.0186752 0.1559108 -0.0219145 -0.1138836 -0.0293601 -0.1255007 0.0119269 -0.0161369 -0.0405537 -0.009414 0.1378768 -0.032199 -0.0915661 -0.0277863 -0.1066557 -0.0047651 -0.0118055 -0.0280781 -0.0104105 0.153706 0.0648272 0.0373937 -0.0179896 0.0651729 -0.0964475 0.0178075 -0.0228074 0.0139962 0.1553098 -0.0981643 0.0521063 -0.0471466 0.0555851 0.0797144 0.0120867 -0.048141 0.0133492 0.1503521 0.3078644 -0.0974731 0.1251217 -0.1067919 0.2301854 0.0967675 0.145289 0.0642056 0.2187868 unknown
polarizability: 188.661037|-4.0909121|130.5809398|12.1508463|-11.9599924|70.7042443 unknown
InChI: InChI=1S/C9H9Cl2NO2/c10-7(11)9(14)12-8(13)6-4-2-1-3-5-6/h1-5,7,9,12,14H
charge 0 multiplicity 1
23 atoms
Cl 3.169258 1.959996 -1.124244
Cl 4.929229 -0.428016 -0.336448
O  2.798028 0.64147 1.671403
O  0.103614 -1.90681 0.760584
N  0.905808 0.207217 0.223354
C  2.287653 -0.130923 0.549892
C  -1.528436 -0.21867 0.129997
C  -0.133435 -0.710523 0.400447
C  3.194174 0.140848 -0.658253
C  -2.544322 -1.200965 -0.000424
C  -1.87228 1.154869 0.016098
C  -3.876798 -0.820381 -0.257306
C  -3.208012 1.534767 -0.236756
C  -4.212107 0.54899 -0.379384
H  2.296225 -1.220517 0.754277
H  0.725138 1.163649 -0.088474
H  2.842838 -0.396465 -1.547679
H  -2.260583 -2.252704 0.108541
H  -1.12233 1.943745 0.151207
H  -4.652701 -1.586327 -0.361355
H  -3.466185 2.596156 -0.31602
H  -5.247618 0.846551 -0.57771
H  2.437042 0.263642 2.512353
