program: Gaussian 09
title: 000037264
version: EM64L-G09RevD.01
frameworkgroup: C1[X(C20H29N5O6)]
method: RPBEPBE
basis: SDD
operation: Freq
keyword: #p
keyword: freq=noraman
keyword: PBEPBE/SDD
title: #p freq=noraman PBEPBE/SDD
converged: YES YES NO NO
title: Mulliken charges:
elementType: O O O O O O N N N N N C C C C C C C C C C C C C C C C C C C C H H H H H H H H H H H H H H H H H H H H H H H H H H H H H
charge: -0.347310 -0.296626 -0.463463 -0.304412 -0.294638 -0.287563 -0.145115 -0.146759 -0.116796 -0.132653 -0.638372 -0.368109 -0.376824 -0.378389 -0.383222 0.061850 0.319446 0.253415 -0.280046 -0.024319 0.405985 0.076489 -0.711074 -0.706854 0.121156 -0.566591 0.034869 0.189941 -0.518731 -0.517901 -0.525279 0.264764 0.212841 0.216843 0.269160 0.240779 0.225286 0.229439 0.258614 0.249215 0.219963 0.235402 0.224247 0.203506 0.235903 0.199906 0.232775 0.220071 0.342314 0.328343 0.334094 0.264508 0.224154 0.214731 0.272056 0.224491 0.221285 0.209871 0.227195 0.266139
chargesum: 0.00000
title: Mulliken charges with hydrogens summed into heavy atoms:
elementType: O O O O O O N N N N N C C C C C C C C C C C C C C C C C C C C
charge: -0.347310 -0.296626 -0.121149 -0.304412 -0.294638 -0.287563 -0.145115 -0.146759 -0.116796 -0.132653 0.024065 0.109496 0.109179 0.087675 0.104831 0.061850 0.319446 0.253415 0.189132 -0.024319 0.405985 0.076489 -0.047919 -0.038269 0.121156 -0.346521 0.034869 0.189941 0.184662 0.199932 0.177926
polarizability: 4.73330655e+02 -3.99821415e+00 2.91692864e+02 2.50240853e+01 -4.23158847e+00 1.72384171e+02
1716.lowfreq: -5.8667 -3.2674 -0.0011 0.0005 0.0009 7.3277 9.8300 21.9102 29.4145
frequency: 9.5621 21.1880 29.4140 33.1589 43.0217 47.1377 60.4966 65.8468 72.7305 80.0990 88.7364 102.9510 108.9424 123.4582 143.8083 147.7049 152.5477 158.6472 165.5748 178.8450 187.8063 188.4650 205.8604 219.5500 221.9893 238.7105 247.6640 252.2506 263.8195 287.0688 293.4964 295.1131 322.1127 326.0053 336.4250 363.7570 374.5787 388.7151 395.5939 399.5163 409.3179 411.0117 429.4380 442.3928 447.6029 458.3528 482.2259 496.4214 513.6354 528.0220 547.7740 562.7484 583.7028 591.5018 596.9843 628.8379 659.9422 664.8975 687.6187 700.9954 722.4585 734.7997 762.1926 793.2986 800.0628 816.9175 845.1898 854.0603 863.3303 875.7654 879.7281 896.1126 913.8143 922.1990 932.2431 949.3570 954.5272 980.0481 988.6033 1000.6383 1005.7203 1019.8580 1034.8451 1047.4170 1051.5776 1077.9663 1100.2444 1106.8008 1109.0839 1111.4021 1120.9110 1144.0757 1152.3421 1156.9099 1157.3206 1159.5040 1162.5382 1196.7632 1202.8044 1206.2188 1220.2241 1232.9262 1247.3950 1258.7389 1267.9926 1278.2165 1307.4514 1309.4345 1325.3170 1331.2995 1348.0264 1356.0462 1360.4932 1365.1552 1375.1492 1376.7511 1384.3488 1393.9723 1406.7703 1409.8064 1420.7359 1429.4875 1443.3618 1450.5613 1453.3106 1455.5086 1458.6868 1459.1423 1461.4271 1462.3712 1464.1203 1466.5139 1470.2636 1476.3042 1482.6335 1485.5724 1486.4671 1486.7070 1488.1824 1503.8876 1530.7930 1553.6528 1608.9621 1623.7840 1646.2146 2961.1238 2967.1952 2970.9042 2974.5911 2980.0175 2984.1669 2984.9384 2986.4523 2994.2904 3016.3072 3079.9546 3080.1345 3081.4422 3087.1314 3093.0725 3095.4920 3095.9193 3097.5365 3098.9322 3100.8196 3102.1270 3114.1766 3122.3469 3125.8533 3130.3379 3142.4311 3534.4662 3556.3828 3711.0362
redmass: 5.4006 4.2174 4.2646 4.7117 4.2758 4.9190 4.6768 3.8155 3.1260 4.4800 2.6827 2.6031 3.8004 2.1589 2.2791 1.5871 1.3999 2.6827 2.1685 1.7450 1.3772 2.7003 4.1962 4.8436 3.5814 5.2989 1.2828 3.3918 2.6530 4.1603 4.1792 4.0756 2.6920 2.5923 4.0532 3.3992 3.5091 2.0724 2.3714 2.0740 1.6842 1.9104 2.4364 3.1482 4.6681 2.7569 3.1201 4.8643 4.8227 1.6010 6.1381 5.1741 4.0497 3.9867 4.4435 2.2081 6.0671 4.6517 11.3259 10.4663 5.9596 4.6540 9.2684 5.0582 3.4169 6.4756 1.5686 4.3580 2.9236 2.7610 4.8576 2.9962 2.1928 7.6036 1.4594 4.5367 2.6890 1.8903 3.0403 2.8826 1.4020 2.6038 6.6089 2.6306 1.8654 4.4384 2.3103 1.2395 1.2733 1.2501 1.5570 2.0150 1.3755 1.5066 1.4358 1.5369 3.0821 2.3109 1.1139 1.7754 3.3681 1.9027 3.4037 2.0927 2.2083 1.7873 3.8083 1.6612 1.2707 2.3912 1.3666 1.7269 1.3932 1.5932 1.5737 2.1928 5.4210 1.2839 1.6729 2.3911 1.3000 1.2318 1.9331 1.0646 1.0742 1.0750 1.2197 1.2011 1.0720 1.1108 1.0954 1.0722 1.1050 1.0735 2.5136 1.0695 1.0646 1.1524 1.0598 5.6398 4.2365 7.1011 7.4154 1.4322 10.1618 1.0697 1.0689 1.0347 1.0321 1.0687 1.0317 1.0357 1.0671 1.0356 1.0569 1.0988 1.0974 1.1008 1.1067 1.1009 1.1002 1.0942 1.0957 1.1013 1.0935 1.0995 1.0935 1.1042 1.1045 1.1052 1.0909 1.0651 1.0454 1.1036
irintensity: 0.0838 0.3842 0.5149 0.0389 1.4490 0.3289 0.2436 0.3093 7.1013 0.4881 7.8887 9.7948 2.5537 0.3612 0.2536 2.2685 1.1637 4.3587 3.2806 3.4215 0.6112 7.0414 3.1308 1.9543 2.0760 13.0286 3.5301 15.3275 0.4612 4.5621 9.1656 2.3414 8.6477 8.7431 4.2847 6.4797 7.6548 30.0465 34.2370 50.0668 126.7194 19.6709 4.1277 38.9892 10.3535 1.5227 27.2181 8.7918 9.1072 81.3109 8.4788 7.4370 5.3269 9.3134 5.4943 2.4271 14.3202 0.2441 17.0553 2.6170 10.3790 7.6383 9.3430 23.9389 19.2548 13.7322 1.4687 24.0532 18.9038 23.3366 45.3566 15.9414 39.1310 40.3792 9.4694 169.6811 2.4178 35.0060 6.4884 22.4839 30.0244 274.9253 78.1382 216.0665 9.7436 102.7329 92.7192 10.7946 16.9947 5.5796 56.4415 81.1749 5.1734 11.7338 10.2278 22.0306 3.5670 48.8336 0.0525 465.2535 62.1992 27.8629 88.3400 325.9238 24.0310 13.6442 29.2770 28.5106 2.4206 33.1927 2.5227 33.9180 15.8927 9.3658 96.3054 94.3793 35.2255 100.5115 48.9346 241.5651 15.9229 17.4104 180.6650 0.5416 12.3415 10.6688 72.6796 66.6648 5.7136 35.1064 29.2022 13.3560 7.1767 3.1422 235.8861 1.5059 61.2087 108.3915 23.8363 63.0917 528.3431 635.0370 56.6172 417.0120 407.9471 50.9370 41.1028 99.6967 96.2322 48.1992 85.8045 20.3765 97.5093 16.6470 28.0799 25.8291 33.3615 24.0806 5.1926 27.5577 20.1086 6.4282 4.6905 43.7595 8.4979 39.1908 11.4475 15.0254 19.2930 15.9757 10.1223 5.8863 81.8964 31.9459
temp: 298.150 k
press: 1.00000 atm
elementType: 8 8 8 8 8 8 7 7 7 7 7 6 6 6 6 6 6 6 6 6 6 6 6 6 6 6 6 6 6 6 6 1 1 1 1 1 1 1 1 1 1 1 1 1 1 1 1 1 1 1 1 1 1 1 1 1 1 1 1 1
symmnumber: 1
zpe: 1270369.5 jmol-1
zpe.correction: 0.483858 hartree
zpe.thermalcorrener: 0.516704 hartree
zpe.thermalcorrenthalpy: 0.517648 hartree
zpe.thermalcorrgfe: 0.417378 hartree
zpe.sumelectzpe: -1502.247761 hartree
zpe.sumelectthermal: -1502.214915 hartree
zpe.sumelectthermalent: -1502.213971 hartree
zpe.sumelectthermalfe: -1502.314241 hartree
dipole: -2.5410 2.7202 2.5270
dipole: 4.4991
quadrupole: -186.6424 -170.2084 -184.0518
quadrupole: 3.0460 9.0132 1.6678
quadrupole: -6.3415 10.0925 -3.7509 3.0460 9.0132 1.6678
hfenergy: -1502.7316193 hartree
pointgroup: C01 [X(C20H29N5O6)]
dipole: -0.9989626 -1.1234679 -0.9343709 debye
polarizability: 473.2976611|2.8360232|290.8940184|-25.3517612|-10.6730944|173.2160101 unknown
InChI: InChI=1S/C20H29N5O6/c1-20(2,27)11-31-19(26)25-8-6-24(7-9-25)18-22-14-12(17(21)23-18)10-13(28-3)15(29-4)16(14)30-5/h10,27H,6-9,11,21H2,1-5H3
charge 0 multiplicity 1
60 atoms
O  5.489719 0.233994 0.107884
O  4.814962 2.481973 -0.017256
O  7.511057 -1.175179 1.452127
O  -3.760185 2.230697 -0.349191
O  -6.35971 1.306149 0.233304
O  -6.815823 -1.450774 0.720536
N  0.69882 -0.143083 -0.695114
N  3.239257 0.752599 0.19155
N  -1.589294 0.362948 -0.4694
N  -0.77456 -1.937497 -0.3058
N  -2.172491 -3.742613 0.098573
C  1.84306 -1.065187 -0.755895
C  1.037954 1.283883 -0.829431
C  2.900834 -0.681935 0.30673
C  2.087595 1.68101 0.232761
C  -0.605884 -0.572814 -0.484042
C  4.515271 1.262077 0.088557
C  7.79059 -0.536789 0.142035
C  6.89658 0.710923 0.000885
C  -2.874899 -0.092705 -0.225526
C  -3.172511 -1.487162 -0.004225
C  -2.028082 -2.383958 -0.07392
C  7.543492 -1.550193 -0.997907
C  9.265351 -0.109691 0.214143
C  -3.963913 0.850025 -0.175288
C  -4.504026 -1.907108 0.263291
C  -5.272262 0.423052 0.147196
C  -5.544472 -0.97713 0.346538
C  -3.206227 2.648441 -1.657242
C  -6.23545 2.429058 1.194205
C  -7.931403 -1.15727 -0.207453
H  1.471256 -2.086368 -0.583901
H  2.30571 -1.011396 -1.763619
H  1.448685 1.47572 -1.842208
H  0.114576 1.868298 -0.697797
H  3.813493 -1.279838 0.171494
H  2.487901 -0.880167 1.31694
H  1.623159 1.641582 1.23857
H  2.464049 2.700845 0.05421
H  7.089143 1.429436 0.816315
H  7.034855 1.21721 -0.971222
H  8.131966 -2.464116 -0.808487
H  6.475384 -1.824522 -1.057313
H  7.845975 -1.133688 -1.976707
H  9.896715 -1.000928 0.370283
H  9.583644 0.389158 -0.718755
H  9.42781 0.575325 1.064064
H  -4.768526 -2.954969 0.440244
H  6.526173 -1.283028 1.521034
H  -1.336339 -4.320397 0.044934
H  -3.073219 -4.17294 0.280928
H  -2.226861 2.169857 -1.821396
H  -3.102248 3.742313 -1.588057
H  -3.911663 2.386226 -2.46876
H  -5.376225 3.06598 0.930996
H  -7.181303 2.984709 1.10475
H  -6.125104 2.031852 2.220529
H  -7.753206 -1.649015 -1.183911
H  -8.823135 -1.589489 0.27172
H  -8.050115 -0.069887 -0.342804
