program: Gaussian 09
title: 000002889
version: EM64L-G09RevD.01
frameworkgroup: C1[X(C21H20O6)]
method: RPBEPBE
basis: SDD
operation: Freq
keyword: #pfreq=noraman
keyword: PBEPBE/SDD
title: #p freq=noraman PBEPBE/SDD
converged: YES YES NO NO
title: Mulliken charges:
elementType: O O O O O O C C C C C C C C C C C C C C C C C C C C C H H H H H H H H H H H H H H H H H H H H
charge: -0.328616 -0.238063 -0.413812 -0.390560 -0.246149 -0.234813 0.541204 0.555732 -0.644994 -0.507846 -0.514416 0.217209 0.213700 -0.390504 -0.416129 -0.293893 -0.304004 0.132745 0.155866 0.173531 0.168804 -0.328737 -0.366833 -0.307009 -0.299495 -0.522372 -0.537899 0.243126 0.244024 0.249670 0.253969 0.241101 0.241372 0.264130 0.269269 0.256785 0.224249 0.242416 0.242088 0.385235 0.360308 0.230909 0.230790 0.246413 0.224370 0.227465 0.249661
chargesum: 0.00000
title: Mulliken charges with hydrogens summed into heavy atoms:
elementType: O O O O O O C C C C C C C C C C C C C C C C C C C C C
charge: -0.328616 -0.238063 -0.028577 -0.030252 -0.246149 -0.234813 0.541204 0.555732 -0.157844 -0.258176 -0.260446 0.217209 0.213700 -0.149402 -0.174756 -0.029763 -0.034734 0.132745 0.155866 0.173531 0.168804 -0.071952 -0.142584 -0.064593 -0.057407 0.185740 0.163597
polarizability: 4.77490689e+02 1.66667524e+01 2.62889042e+02 -1.11366159e+01 -1.82173336e+01 2.37662906e+02
1716.lowfreq: -11.8919 -7.1283 -6.2071 -2.2225 -0.0004 0.0004 0.0008 7.9222 12.4897
frequency: -8.9621 7.8469 12.3850 30.0030 45.3552 65.0978 66.3006 81.4324 85.0922 90.2046 100.1910 130.0022 146.3857 171.2600 174.5272 176.7757 189.9697 218.0530 219.7386 221.4196 237.5982 270.5236 277.0602 283.1743 287.0409 325.8318 339.4297 368.4097 383.9758 398.2826 430.3806 447.2018 449.4918 458.8710 474.3472 486.4765 505.8852 530.6852 532.2897 544.3642 555.4609 571.1152 578.7960 605.1152 620.8087 646.6018 709.1275 726.9908 734.7064 735.8558 765.8836 785.9306 791.2268 803.8668 824.0789 852.2521 865.4556 881.0562 887.8091 905.9025 910.2278 918.1638 923.7826 934.2008 950.7447 950.9699 1001.6635 1003.9206 1008.5962 1009.5925 1056.1753 1089.4267 1111.4244 1111.9330 1116.3831 1129.9714 1150.3830 1152.3966 1167.9024 1169.5180 1175.6761 1185.9446 1214.9921 1220.4012 1232.8623 1237.6212 1270.2947 1274.8292 1288.1401 1293.9138 1310.9700 1320.3665 1334.0794 1343.7855 1409.9180 1411.4174 1423.4417 1430.1643 1442.3738 1449.0810 1449.7554 1466.1065 1467.7753 1469.8405 1473.3239 1505.8458 1508.2360 1540.0991 1556.9995 1591.0473 1594.7226 1607.0323 1613.2449 1629.4209 1642.9679 2962.7216 2970.3996 3026.2328 3052.1652 3062.0809 3087.7695 3093.9233 3103.9409 3117.9284 3128.4354 3132.1380 3132.5806 3132.9777 3147.4550 3151.1101 3154.6972 3167.5290 3177.8296 3500.4011 3568.5665
redmass: 5.1751 8.2126 4.1483 6.7220 6.4799 6.3630 7.5989 5.0861 3.6741 5.0567 3.5778 4.0122 4.2151 2.9605 2.9660 4.4767 3.3062 1.4430 2.2472 3.8808 5.9080 3.7881 2.2015 2.8429 4.1909 4.3387 3.8076 3.9922 1.5431 2.0052 5.7491 3.1089 2.8865 2.8277 5.8449 7.0883 6.2905 4.7868 1.0924 4.3128 4.7915 4.2573 4.8344 3.9649 4.2071 4.7335 6.2081 3.6019 5.1618 2.9408 4.5349 5.4974 2.9153 1.7974 1.4347 1.6336 1.6656 2.5603 1.9765 4.6273 2.8743 2.4821 1.4732 3.0513 3.2738 1.4970 3.5467 4.4524 1.1996 1.2031 1.6320 2.0692 1.2626 2.0917 1.2563 3.1966 1.3612 1.3155 1.4135 1.6657 2.0318 1.3656 1.3956 2.0443 1.6302 1.4289 2.1225 2.5407 1.4976 1.6212 1.4002 1.3459 2.7108 2.9659 3.1847 3.1777 2.4900 1.9649 1.0910 1.7357 1.8842 1.0493 1.0493 1.0745 1.0926 3.0973 3.2194 9.6955 7.7640 5.9854 5.8296 6.5738 6.6546 5.4529 5.5888 1.0330 1.0323 1.0572 1.1041 1.1047 1.0890 1.0895 1.1057 1.0887 1.0911 1.0995 1.1003 1.0916 1.0911 1.0955 1.0882 1.0903 1.0967 1.0644 1.0660
irintensity: 0.3465 0.2605 0.5341 1.4083 0.1221 1.2680 2.2318 5.6978 8.1765 0.3757 11.8844 1.7445 0.3609 0.7476 0.8439 9.8510 0.7761 0.4444 0.3568 0.2241 4.9967 0.4698 0.1344 0.0746 0.1777 11.6163 12.0140 0.0997 69.3162 68.3039 7.3500 3.3598 0.1383 17.2283 20.1137 31.7496 6.7512 71.8381 153.0032 1.0355 2.2110 0.4335 8.1245 9.4183 2.8549 41.2042 8.8519 2.3219 11.3602 1.1490 2.8065 22.2637 50.0143 19.3846 19.1382 23.0243 26.1983 5.9554 2.5652 22.1212 1.4529 22.2742 1.2741 101.7838 90.1060 7.4637 37.5756 47.6037 79.3883 60.8680 83.6288 382.5165 0.1242 44.7325 0.1007 804.0608 4.5715 38.8433 21.8647 122.4038 114.1769 257.6296 2.7330 29.8124 176.6935 63.7900 414.8027 166.5942 58.6193 13.2390 48.7209 16.6585 39.0118 29.2706 17.0260 10.7663 33.7774 3.9933 14.7828 13.2452 60.3766 15.1393 14.7787 66.2693 84.1162 536.3020 198.2922 686.6376 214.3253 65.2561 106.4496 92.2192 106.9621 380.7093 81.1510 39.8436 47.5645 8.9606 42.8402 39.3631 2.2387 1.8166 13.6831 21.7099 9.1478 24.0608 25.1830 8.0137 6.5664 11.4733 2.5907 3.9486 6.3166 177.4293 95.3284
temp: 298.150 k
press: 1.00000 atm
elementType: 8 8 8 8 8 8 6 6 6 6 6 6 6 6 6 6 6 6 6 6 6 6 6 6 6 6 6 1 1 1 1 1 1 1 1 1 1 1 1 1 1 1 1 1 1 1 1
symmnumber: 1
zpe: 946463.6 jmol-1
zpe.correction: 0.360489 hartree
zpe.thermalcorrener: 0.386239 hartree
zpe.thermalcorrenthalpy: 0.387184 hartree
zpe.thermalcorrgfe: 0.301362 hartree
zpe.sumelectzpe: -1261.568813 hartree
zpe.sumelectthermal: -1261.543062 hartree
zpe.sumelectthermalent: -1261.542118 hartree
zpe.sumelectthermalfe: -1261.627940 hartree
dipole: 0.5780 -4.2421 0.0568
dipole: 4.2817
quadrupole: -127.5241 -154.6209 -149.8656
quadrupole: -19.7490 21.0312 -2.7428
quadrupole: 16.4794 -10.6173 -5.8621 -19.7490 21.0312 -2.7428
hfenergy: -1261.9293015 hartree
pointgroup: C01 [X(C21H20O6)]
dipole: 0.20274 -1.6511329 -0.265315 debye
polarizability: 475.6503744|16.3477815|267.9304854|-23.6730758|-14.1657652|234.4617776 unknown
InChI: InChI=1S/C21H20O6/c1-26-20-11-14(5-9-18(20)24)3-7-16(22)13-17(23)8-4-15-6-10-19(25)21(12-15)27-2/h3-12,24-25H,13H2,1-2H3
charge 0 multiplicity 1
47 atoms
O  6.770896 -2.037856 -0.94254
O  -5.850455 -2.159848 0.947863
O  7.370114 0.056235 -2.48384
O  -7.38034 -1.632429 -1.167238
O  0.550389 0.246253 2.718803
O  -0.751812 3.669547 0.197775
C  3.99296 0.34484 0.056789
C  -4.093758 0.927179 -0.349239
C  -0.031827 2.578134 2.267493
C  4.781796 -0.84833 0.031617
C  -4.392033 -0.19885 0.479513
C  5.899147 -0.938339 -0.809336
C  -5.482932 -1.040741 0.200273
C  4.36775 1.427922 -0.791563
C  -4.92684 1.182073 -1.471447
C  2.838196 0.391893 0.950318
C  -2.96847 1.822389 -0.093174
C  6.259952 0.156031 -1.651228
C  -6.31177 -0.763849 -0.937446
C  0.840926 1.320062 2.099735
C  -0.962584 2.747362 1.046487
C  5.48781 1.335243 -1.63689
C  -6.022454 0.345549 -1.760055
C  1.975755 1.440774 1.161447
C  -2.058944 1.763126 0.935185
C  6.500181 -3.22465 -0.127221
C  -5.029955 -2.482594 2.119673
H  0.59439 3.482989 2.339921
H  -0.631057 2.451412 3.185477
H  4.497947 -1.684153 0.680105
H  -3.753524 -0.407572 1.342119
H  3.774689 2.347401 -0.795587
H  -4.71193 2.040092 -2.117576
H  2.624971 -0.518529 1.531751
H  -2.827035 2.646274 -0.809053
H  5.780698 2.159746 -2.292928
H  -6.65893 0.552795 -2.629932
H  2.088581 2.40149 0.645449
H  -2.099273 0.986549 1.708586
H  7.781752 -0.840882 -2.356094
H  -7.885186 -1.355077 -1.972952
H  5.507932 -3.650333 -0.369081
H  6.552721 -2.98164 0.950995
H  7.28923 -3.944973 -0.386758
H  -5.050794 -1.661865 2.862729
H  -3.982869 -2.697362 1.830879
H  -5.490911 -3.384088 2.547792
