program: Gaussian 09
title: 000037207
version: EM64L-G09RevD.01
frameworkgroup: C1[X(C12H7ClO2)]
method: RPBEPBE
basis: SDD
operation: Freq
keyword: #p
keyword: freq=noraman
keyword: PBEPBE/SDD
title: #p freq=noraman PBEPBE/SDD
converged: NO NO NO YES
title: Mulliken charges:
elementType: Cl O O C C C C C C C C C C C C H H H H H H H
charge: -0.019630 -0.264208 -0.283372 0.379522 0.271706 0.252732 0.235949 -0.312351 -0.382546 -0.362325 -0.360570 -0.254414 -0.210832 -0.223854 -0.223643 0.263553 0.264401 0.260066 0.258657 0.239115 0.236193 0.235849
chargesum: 0.00000
title: Mulliken charges with hydrogens summed into heavy atoms:
elementType: Cl O O C C C C C C C C C C C C
charge: -0.019630 -0.264208 -0.283372 0.379522 0.271706 0.252732 0.235949 -0.312351 -0.118992 -0.097923 -0.100504 0.004243 0.028283 0.012339 0.012206
polarizability: 2.21998591e+02 1.07450839e+01 1.60222446e+02 -1.88491337e-03 5.05550193e-03 5.36335269e+01
1716.lowfreq: -0.0004 0.0019 0.0019 6.4885 13.4461 13.9265 45.7260 81.9050 140.4769
frequency: 45.7093 81.8428 140.4707 177.6954 234.3043 263.4151 275.1221 287.0117 361.3211 400.8165 446.0764 461.9237 515.6941 519.4973 525.8818 533.9502 554.3599 628.1452 658.3771 673.5270 692.2004 736.2221 758.2341 765.3234 806.9240 849.0790 853.3733 878.3979 884.9929 931.1088 953.8648 971.9943 1025.3640 1056.5455 1078.7017 1116.5403 1152.5995 1163.5210 1164.7283 1201.6718 1220.9096 1263.7779 1272.5010 1372.8311 1395.8598 1431.2974 1448.1335 1455.7484 1477.0667 1579.9104 1584.7988 1612.0046 1632.2660 3144.3632 3153.7138 3157.9328 3169.4895 3172.6976 3180.3704 3184.4191
redmass: 6.9998 5.8654 11.7632 5.7889 5.9928 5.4758 6.2469 6.4200 7.8109 8.1988 3.1483 6.3286 4.4034 5.0400 9.2954 4.5815 11.3439 7.8947 6.7794 4.4196 4.2776 6.8652 1.2289 1.3294 6.5162 1.3510 7.3029 1.3598 8.4092 1.3670 1.3010 1.2972 2.0101 2.0901 2.9472 4.8884 1.9147 1.2710 1.1027 2.2332 2.0593 2.6981 1.6337 10.5318 7.4674 2.3901 3.2784 3.0809 3.0134 7.4640 7.3690 7.9773 8.2991 1.0858 1.0870 1.0904 1.0948 1.0926 1.1006 1.0994
irintensity: 3.0970 0.0992 0.8101 0.1755 0.1855 0.1219 0.9119 0.4977 1.9508 2.0097 4.9494 0.1092 0.0304 0.5412 0.4977 0.1090 0.5879 5.4488 0.4268 6.5349 6.4419 5.0544 125.1804 63.7337 36.3985 0.0001 48.6450 1.1052 73.6431 5.8785 1.7255 0.0018 11.9619 12.8156 18.6813 5.4575 0.8090 0.0850 4.7142 4.4607 16.0381 366.1769 85.7397 28.7858 2.8779 8.9356 248.6626 113.8605 223.3066 56.3390 1.9667 9.2475 5.9373 1.9622 5.9248 12.6544 5.6684 1.8669 10.6487 5.0703
temp: 298.150 k
press: 1.00000 atm
elementType: 17 8 8 6 6 6 6 6 6 6 6 6 6 6 6 1 1 1 1 1 1 1
symmnumber: 1
zpe: 405155.0 jmol-1
zpe.correction: 0.154315 hartree
zpe.thermalcorrener: 0.165610 hartree
zpe.thermalcorrenthalpy: 0.166554 hartree
zpe.thermalcorrgfe: 0.116413 hartree
zpe.sumelectzpe: -1070.936242 hartree
zpe.sumelectthermal: -1070.924947 hartree
zpe.sumelectthermalent: -1070.924003 hartree
zpe.sumelectthermalfe: -1070.974144 hartree
dipole: -0.9598 1.5807 -0.0001
dipole: 1.8493
quadrupole: -75.9648 -87.2930 -97.5638
quadrupole: 7.4143 0.0003 0.0003
quadrupole: 10.9758 -0.3525 -10.6233 7.4143 0.0003 0.0003
hfenergy: -1071.0905574 hartree
pointgroup: C01 [X(C12H7Cl1O2)]
dipole: 0.2930057 0.6659503 0.0000235 debye
dipolederiv: -0.1057898 -0.0896358 0.0000065 -0.1851334 -0.677345 0.0000411 0.0000122 0.0000408 -0.0373211 -1.9125286 0.1247057 0.0000118 0.2040204 -0.2947158 -0.0000057 0.0000092 -0.0000188 -0.1322406 -1.9339975 0.0938772 0.0000125 0.1486262 -0.3926976 0.0000195 0.0000199 0.0000307 -0.1504575 0.9522314 -0.2625145 -0.000026 -1.1241545 -0.0806512 0.000038 0.0000012 0.0000303 0.0995405 1.3068797 0.0588035 -0.0000361 0.7819975 0.1396597 -0.0000181 -0.0000737 -0.0000091 0.0794036 1.2889013 0.0879292 0.0000115 0.7559627 0.0260614 -0.0000007 -0.0000094 0.0000092 0.0695792 1.0307923 -0.2365401 0.000024 -0.9942889 0.2041046 -0.000008 0.0000558 -0.0000166 0.0711672 0.0282061 0.1648617 -0.0000125 0.3074281 1.0430104 -0.0000712 -0.0000139 -0.0000728 -0.0895428 -0.2865685 -0.016076 -0.0000005 0.0775883 0.021917 -0.0000129 -0.0000012 -0.000013 -0.1758602 -0.2328508 -0.0144432 0.0000064 0.0607629 0.0571475 -0.0000018 -0.0000048 -0.0000005 -0.1551719 -0.2329156 0.0720277 0.0000009 0.0041704 0.0648037 -0.0000117 0.000001 -0.0000081 -0.1609917 -0.0999068 -0.0035622 -0.0000023 -0.0099895 -0.2713879 0.0000084 -0.0000054 0.0000099 -0.1237897 0.056401 0.0522428 -0.000009 -0.0191017 0.0670853 -0.0000091 -0.0000128 -0.00001 -0.1586819 0.011366 -0.030147 0.000009 -0.0620146 0.0148494 -0.0000148 0.0000203 -0.0000162 -0.1703818 0.0298546 0.0146931 0.0000058 0.0585928 -0.0028147 -0.0000045 0.000009 -0.0000057 -0.1702212 0.0984649 -0.0437319 0.0000048 -0.022162 -0.0256919 0.0000109 0.0000018 0.0000119 0.1801795 0.0999522 -0.0437958 -0.0000012 -0.0217368 -0.0216049 0.0000065 -0.0000009 0.0000051 0.1762068 0.1058949 0.0131369 -0.0000025 -0.0111368 -0.0395667 0.0000091 -0.000001 0.0000076 0.1763313 -0.0178262 -0.0487093 0.0000078 -0.0611803 0.0747617 0.0000074 0.0000096 0.0000085 0.1715304 -0.040517 0.0861904 0.0000018 0.0863254 0.0108039 0.0000046 0.0000044 0.0000028 0.1657549 -0.0528675 0.0910048 -0.0000101 0.1008806 0.0214607 0.0000101 -0.0000141 0.0000115 0.1673611 -0.0931759 -0.0703172 -0.0000027 -0.0754569 0.0608104 0.0000031 -0.0000072 0.0000027 0.1676061 unknown
polarizability: 223.7286576|-2.3636538|158.4923798|-0.0012072|-0.0052587|53.6335269 unknown
InChI: InChI=1S/C12H7ClO2/c13-8-4-3-7-11-12(8)15-10-6-2-1-5-9(10)14-11/h1-7H
charge 0 multiplicity 1
22 atoms
Cl -2.597216 -2.716348 0.000233
O  0.015594 -1.263786 -0.000003
O  0.350135 1.63699 -0.000121
C  -1.087719 -0.379625 0.000031
C  -0.932597 1.031596 -0.000031
C  1.301535 -0.65377 0.000016
C  1.464522 0.752591 -0.000042
C  -2.389035 -0.916588 0.000116
C  -2.049874 1.881244 -0.00003
C  2.421511 -1.498933 0.000085
C  2.749054 1.317812 -0.000038
C  -3.524897 -0.079747 0.000107
C  -3.34783 1.32062 0.000032
C  3.718925 -0.933807 0.000091
C  3.882251 0.470116 0.000027
H  -1.887809 2.962509 -0.000089
H  2.262348 -2.581257 0.000118
H  2.844074 2.407713 -0.000081
H  -4.523522 -0.524802 0.00016
H  -4.223662 1.976276 0.00003
H  4.593766 -1.5915 0.000153
H  4.884846 0.909094 0.000035
