program: Gaussian 09
title: 000037197
version: EM64L-G09RevD.01
frameworkgroup: C1[X(C6H8N2O2)]
method: RPBEPBE
basis: SDD
operation: Freq
keyword: #pfreq=noraman
keyword: PBEPBE/SDD
title: #p freq=noraman PBEPBE/SDD
converged: NO YES NO NO
title: Mulliken charges:
elementType: O O N N C C C C C C H H H H H H H H
charge: -0.267862 -0.188865 -0.384788 -0.078290 0.236226 0.222299 -0.274591 -0.756699 0.206702 -0.793238 0.339319 0.275698 0.246589 0.246635 0.220232 0.240738 0.271256 0.238639
chargesum: 0.00000
title: Mulliken charges with hydrogens summed into heavy atoms:
elementType: O O N N C C C C C C
charge: -0.267862 -0.188865 -0.045469 -0.078290 0.236226 0.222299 0.001107 -0.043243 0.206702 -0.042605
polarizability: 1.26258027e+02 2.03138494e+00 8.65152326e+01 3.39417024e-02 -1.55274710e-02 4.63200725e+01
1716.lowfreq: -55.9264 -16.0919 -5.7901 -0.4932 0.0011 0.0011 0.0011 32.0380 82.3957
frequency: -55.9118 31.8636 82.3930 115.0783 126.1030 217.3323 272.6896 328.4298 338.1166 390.0446 550.5976 566.8404 605.4125 622.4118 646.9821 682.1429 724.2039 771.7355 872.5072 901.1679 956.8604 985.6855 1007.3664 1029.9685 1030.8875 1048.8228 1150.1055 1208.3985 1218.7159 1272.5543 1376.9008 1404.4013 1446.6145 1455.4651 1467.6355 1468.4036 1497.1931 1579.7914 1609.5343 1665.4049 2988.9374 2993.0180 3074.2769 3077.1260 3102.5811 3138.9760 3282.2201 3539.2106
redmass: 1.0618 5.8492 3.2202 4.7508 1.0824 3.7729 3.8211 4.0402 5.0156 3.9539 4.2081 2.9933 2.0977 1.4395 4.6353 7.2471 1.4395 6.4790 4.9317 6.1529 3.1132 2.1074 1.9594 4.7527 1.6705 1.4946 2.7665 2.0650 2.3396 4.3979 1.2326 1.2602 1.1207 1.0436 1.0467 1.0961 1.6965 6.1539 7.9771 7.4757 1.0384 1.0367 1.0984 1.0981 1.0997 1.0980 1.1017 1.0766
irintensity: 0.2511 3.6458 5.0737 5.5883 0.4787 7.5563 0.8842 1.7420 0.4878 0.5963 14.7979 0.7460 74.9555 34.9971 13.8009 25.9524 29.8528 13.9601 23.7403 2.7136 14.8618 7.6309 2.5988 32.9977 9.8968 7.7208 6.4345 137.8813 42.4375 9.9734 50.0943 19.8001 106.4414 14.7340 20.3371 13.8119 349.5129 177.1420 145.2872 158.8770 7.3689 21.5455 13.9919 14.3459 17.8612 6.6192 2.0669 37.7800
temp: 298.150 k
press: 1.00000 atm
elementType: 8 8 7 7 6 6 6 6 6 6 1 1 1 1 1 1 1 1
symmnumber: 1
zpe: 358419.8 jmol-1
zpe.correction: 0.136515 hartree
zpe.thermalcorrener: 0.146016 hartree
zpe.thermalcorrenthalpy: 0.146960 hartree
zpe.thermalcorrgfe: 0.100627 hartree
zpe.sumelectzpe: -492.626419 hartree
zpe.sumelectthermal: -492.616918 hartree
zpe.sumelectthermalent: -492.615974 hartree
zpe.sumelectthermalfe: -492.662307 hartree
dipole: -0.0146 -4.2661 0.0107
dipole: 4.2662
quadrupole: -41.4202 -63.1593 -59.1783
quadrupole: -7.7923 0.0277 0.0065
quadrupole: 13.1658 -8.5734 -4.5924 -7.7923 0.0277 0.0065
hfenergy: -492.7629338 hartree
pointgroup: C01[X(C6H8N2O2)]
dipole: -0.0826541 -1.6763978 0.0034801 debye
dipolederiv: -0.5472502 0.2414429 0.0003541 -0.1027832 -0.7373873 -0.0007764 0.0000818 -0.0008514 -0.1038847 -0.5519662 0.0475846 -0.0002753 -0.5365291 -0.9067724 0.0006395 -0.0009556 0.0011113 -0.3042447 -1.9197149 -0.2723387 -0.0002382 -0.4024038 -0.5074915 -0.0006129 -0.0001933 -0.0000962 -0.3481386 -0.6779491 0.1756077 0.0000942 0.3985371 -0.4053891 -0.000299 0.0000403 -0.0002775 -0.2208771 0.4951877 -0.1984203 -0.0002019 -0.2888227 0.2845749 0.0003231 -0.0003784 0.0004211 -0.0195823 1.519845 -0.0644271 -0.0002891 -0.2939591 0.5970983 0.00083 -0.0007689 0.0008918 0.1901724 -0.0662319 -0.214657 -0.0004089 -0.0037868 0.1268653 0.0003803 0.0000349 0.0003826 -0.2107054 -0.0062144 0.0676626 0.0000913 0.1397819 -0.0395044 -0.0000268 0.0003242 -0.0001728 0.0570398 1.7733176 0.1851264 0.0021353 1.0120314 1.2946999 -0.0016349 0.0063813 -0.0025727 0.1859578 -0.4122516 0.122795 -0.0009159 0.2354859 -0.1099152 0.0035035 -0.0091943 0.005107 0.0580268 0.1719158 -0.0198573 0.0000282 -0.0145378 0.1660812 -0.0000811 0.0000593 -0.0004832 0.3326341 0.0558847 -0.0206621 -0.000009 -0.0467566 0.0773979 -0.0001818 -0.0000869 -0.0001488 0.2417663 0.0762902 0.0162698 -0.0342727 0.0420072 0.0203106 -0.0968426 0.0155713 -0.1190646 -0.0287503 0.0763436 0.0159568 0.0344573 0.0418984 0.0196752 0.0970018 -0.0153208 0.1191852 -0.0278952 -0.1098549 -0.0386293 -0.0001925 -0.1272094 0.0264627 -0.0002371 -0.0003119 -0.0001582 0.120752 0.0588517 0.0054219 0.0246325 0.0310045 0.0438497 0.1037174 -0.025827 0.1079296 -0.0323557 0.0044218 -0.0506172 0.0026469 -0.114353 0.0174506 0.0036478 0.005803 0.0021663 0.133468 0.0593753 0.0017413 -0.0276362 0.0303949 0.0319936 -0.1093509 0.0247412 -0.1133694 -0.0233832 unknown
polarizability: 126.3605434|0.2035097|86.4127158|0.0415785|0.0000711|46.320073 unknown
InChI: InChI=1S/C6H8N2O2/c1-4-3-10-6(7-4)8-5(2)9/h3,8H,1-2H3
charge 0 multiplicity 1
18 atoms
O  -0.900762 -1.568146 -0.001969
O  2.164465 1.505426 -0.002145
N  1.265537 -0.667464 -0.000983
N  -0.787877 0.733739 0.000818
C  -2.159131 0.326862 0.000341
C  -0.097712 -0.392664 -0.000583
C  -2.231025 -1.050404 -0.001251
C  -3.254248 1.348712 0.001621
C  2.33366 0.263925 -0.00052
C  3.702429 -0.416325 0.002808
H  1.49704 -1.663836 -0.001264
H  -3.027959 -1.7850 -0.002026
H  -3.175409 1.998191 0.891629
H  -3.174457 2.001342 -0.885984
H  -4.248802 0.872613 0.000261
H  3.842113 -1.029129 0.912636
H  4.479357 0.360618 -0.021649
H  3.82828 -1.073461 -0.877541
