program: Gaussian 09
title: 000037211
version: EM64L-G09RevD.01
frameworkgroup: C1[X(C17H17NO6)]
method: RPBEPBE
basis: SDD
operation: Freq
keyword: #p
keyword: freq=noraman
keyword: PBEPBE/SDD
title: #p freq=noraman PBEPBE/SDD
converged: YES YES NO NO
title: Mulliken charges:
elementType: O O O O O O N C C C C C C C C C C C C C C C C C H H H H H H H H H H H H H H H H H
charge: -0.246072 -0.281837 -0.224248 -0.264944 -0.256814 -0.224849 -0.098708 -0.338791 -0.350363 -0.354428 -0.319331 -0.314225 -0.263255 0.337287 0.199003 0.191425 -0.433826 0.165305 -0.554005 -0.503337 0.240231 0.259835 -0.124903 -0.131006 0.196603 0.207806 0.213112 0.192733 0.219722 0.200478 0.216612 0.195687 0.194604 0.215377 0.242460 0.235000 0.291967 0.277345 0.289366 0.250765 0.252220
chargesum: 0.00000
title: Mulliken charges with hydrogens summed into heavy atoms:
elementType: O O O O O O N C C C C C C C C C C C C C C C C C
charge: -0.246072 -0.281837 -0.224248 -0.264944 -0.256814 -0.224849 -0.098708 0.065618 0.055482 0.065772 0.092967 0.095756 0.214204 0.337287 0.199003 0.191425 -0.141859 0.165305 -0.276660 -0.213971 0.240231 0.259835 0.125863 0.121214
polarizability: 4.01032039e+02 2.33006923e+01 1.97801504e+02 -1.34032209e+01 1.75879325e+00 1.15395378e+02
1716.lowfreq: -2.7028 0.0006 0.0010 0.0011 2.1052 9.9754 15.3954 22.2697 26.0313
frequency: 15.3241 20.8898 25.8200 47.0763 59.9845 65.4485 88.7934 99.5426 133.1985 137.5391 151.7517 170.5513 221.2320 235.7232 251.1119 282.6443 297.6418 316.1899 323.3867 374.8390 388.0062 389.1337 408.6132 434.0954 445.9615 468.3182 469.1170 478.4524 521.6164 532.6167 572.8692 593.6761 604.9757 642.0198 710.7842 711.4077 721.5665 729.2454 732.3318 742.2491 771.8840 795.4297 811.5292 832.3956 833.1084 842.2353 845.5246 854.9740 866.9159 885.6074 893.7052 898.6075 920.5755 960.2126 996.0439 1001.6700 1027.7238 1047.9001 1052.3222 1061.6573 1072.5120 1080.2859 1094.5784 1110.5175 1122.3550 1138.2913 1151.7311 1154.1124 1174.7732 1191.8373 1205.7475 1220.6392 1246.4989 1251.1785 1268.3061 1271.0431 1287.0358 1294.8542 1314.7161 1318.7696 1327.5227 1334.8370 1349.4878 1365.7270 1372.3551 1391.4957 1398.0844 1443.7472 1444.9864 1448.6149 1452.4714 1460.9185 1471.5705 1480.3070 1483.2157 1536.7136 1585.9475 1636.0100 1643.1673 1657.7243 2865.1690 2871.7334 2893.3278 2955.8212 2960.6680 3017.9813 3029.2453 3038.2819 3040.0133 3081.6832 3085.4741 3090.2388 3176.8358 3193.9536 3222.3541 3243.0494 3252.2697
redmass: 5.9340 3.5305 5.5686 5.4073 5.8123 5.0806 5.4144 3.5150 4.1567 5.8303 6.0627 4.6702 6.8932 2.2456 3.0041 8.0527 6.2360 5.2261 2.4520 3.7712 3.3961 9.6660 2.7416 3.0087 7.4029 5.3392 2.8807 6.6910 6.6602 9.1746 6.6612 3.3384 2.4902 7.0382 6.0349 6.9365 4.5914 1.2760 7.4793 5.7142 3.2739 1.4659 3.0115 1.1992 3.6996 1.6030 1.3585 1.4190 6.5980 1.4981 5.4980 3.0041 5.9118 3.6475 4.5632 2.7249 2.1933 4.4681 2.3788 1.9842 11.0329 2.6221 3.5171 2.2858 1.7880 2.4817 1.8016 1.9117 3.4878 1.0649 1.3285 1.3126 1.5596 1.3215 4.6233 1.2614 1.2651 1.2893 4.2072 1.5047 1.3263 1.2544 1.3012 1.4514 1.2692 3.8312 1.5795 1.0829 7.7932 1.0799 1.0972 1.0977 1.0853 6.0848 1.0866 8.0393 9.3700 8.4562 11.7270 6.9420 1.0704 1.0693 1.0695 1.0665 1.0665 1.0579 1.0901 1.0892 1.0895 1.0964 1.0979 1.1083 1.0931 1.0939 1.0878 1.0987 1.1050
irintensity: 0.1410 0.2058 0.0355 2.4913 0.2965 0.6418 4.1777 2.9848 5.6756 0.3306 2.6382 1.9082 1.5573 6.2851 9.4033 7.4926 3.3167 2.7788 11.2179 12.8658 2.4397 4.0065 12.6168 6.1742 5.5214 0.0025 0.9531 2.8002 1.2684 29.6086 0.5312 5.3070 4.8852 0.4120 15.6565 11.1393 0.7703 73.3694 18.0574 20.5367 3.2000 5.1267 17.1180 0.2813 2.8566 0.1395 2.5362 13.7414 22.6133 75.9034 4.0533 12.0137 43.1416 72.3612 9.8784 37.1316 17.8413 337.9262 39.3536 41.7846 177.3471 15.7857 83.3597 5.1108 20.4234 110.4869 182.2874 36.0068 268.0130 2.2535 1.4146 5.5495 212.1687 21.1530 132.9073 5.1633 16.7445 2.7679 199.3388 18.1416 1.7988 3.1200 6.1203 4.5397 3.0768 135.3993 2.7354 2.9838 9.4360 0.4998 19.6461 5.2993 7.2298 34.0664 11.9839 172.0928 38.8959 47.1958 426.6057 55.8383 49.1083 78.9473 108.4893 40.5622 93.9473 21.8190 33.3377 40.0339 22.2227 40.2486 33.6556 32.8752 1.5270 2.8718 2.6947 0.9323 10.2963
temp: 298.150 k
press: 1.00000 atm
elementType: 8 8 8 8 8 8 7 6 6 6 6 6 6 6 6 6 6 6 6 6 6 6 6 6 1 1 1 1 1 1 1 1 1 1 1 1 1 1 1 1 1
symmnumber: 1
zpe: 825953.0 jmol-1
zpe.correction: 0.314589 hartree
zpe.thermalcorrener: 0.335624 hartree
zpe.thermalcorrenthalpy: 0.336568 hartree
zpe.thermalcorrgfe: 0.261405 hartree
zpe.sumelectzpe: -1162.256789 hartree
zpe.sumelectthermal: -1162.235754 hartree
zpe.sumelectthermalent: -1162.234810 hartree
zpe.sumelectthermalfe: -1162.309973 hartree
dipole: -2.6506 -3.5080 -0.0181
dipole: 4.3968
quadrupole: -124.3970 -142.9022 -140.1072
quadrupole: 2.8893 -6.4660 4.4558
quadrupole: 11.4051 -7.1001 -4.3051 2.8893 -6.4660 4.4558
hfenergy: -1162.5713778 hartree
pointgroup: C01 [X(C17H17N1O6)]
dipole: -1.0458078 -1.3769364 0.0518835 debye
polarizability: 401.1576709|22.263552|197.7024858|-14.110163|-1.7778896|115.3687642 unknown
InChI: InChI=1S/C17H17NO6/c19-17(23-6-3-18-1-4-20-5-2-18)16-10-12-9-14-15(11-13(12)24-16)22-8-7-21-14/h7-11H,1-6H2
charge 0 multiplicity 1
41 atoms
O  8.287257 -0.462183 0.584029
O  1.780191 0.166568 -0.342371
O  -1.573507 1.619859 -0.262051
O  -5.85478 -1.92727 0.250602
O  -6.406687 0.935397 0.08466
O  1.163038 2.426003 -0.499626
N  5.480165 -0.372649 -0.164924
C  5.98431 0.348554 1.034797
C  6.311457 -1.576925 -0.4260
C  4.031286 -0.672288 -0.098566
C  7.46047 0.729153 0.836775
C  7.782545 -1.167225 -0.606169
C  3.209361 0.569984 -0.463858
C  -2.432765 -0.529752 -0.05911
C  -2.744558 0.861678 -0.137449
C  -0.509032 0.675198 -0.26018
C  -0.994585 -0.621787 -0.139475
C  0.849048 1.218699 -0.381219
C  -3.496128 -1.464633 0.071802
C  -4.049777 1.37658 -0.092756
C  -4.802206 -0.972859 0.118149
C  -5.079513 0.434377 0.036877
C  -7.162025 -1.37829 0.298389
C  -7.421024 -0.052826 0.221866
H  5.887723 -0.283205 1.953956
H  5.393012 1.26924 1.192033
H  5.95227 -2.06809 -1.350036
H  6.241269 -2.316705 0.410874
H  3.802888 -1.470727 -0.827998
H  3.713511 -1.043793 0.90596
H  7.877332 1.189977 1.747377
H  7.54992 1.436244 -0.01581
H  7.878367 -0.511779 -1.498677
H  8.430352 -2.051697 -0.722896
H  3.409137 0.890641 -1.501009
H  3.395593 1.425609 0.208947
H  -0.377202 -1.516256 -0.114195
H  -3.327062 -2.542399 0.137086
H  -4.272542 2.443477 -0.153486
H  -7.925793 -2.146546 0.403087
H  -8.416115 0.385545 0.256696
