program: Gaussian 09
title: 000037167
version: EM64L-G09RevD.01
frameworkgroup: C1[X(C6H14N4O2)]
method: RPBEPBE
basis: SDD
operation: Freq
keyword: #p
keyword: freq=noraman
keyword: PBEPBE/SDD
title: #p freq=noraman PBEPBE/SDD
converged: YES YES NO NO
title: Mulliken charges:
elementType: O O N N N N C C C C C C H H H H H H H H H H H H H H
charge: -0.247962 -0.247964 -0.242544 -0.242551 -0.362428 -0.362420 -0.326349 -0.326343 -0.681879 -0.681881 0.149457 0.149454 0.237610 0.186845 0.237608 0.186843 0.281087 0.281091 0.205005 0.243992 0.221378 0.205005 0.243992 0.221379 0.335786 0.335786
chargesum: 0.00000
title: Mulliken charges with hydrogens summed into heavy atoms:
elementType: O O N N N N C C C C C C
charge: -0.247962 -0.247964 0.038543 0.038541 -0.026642 -0.026634 0.098106 0.098109 -0.011503 -0.011505 0.149457 0.149454
polarizability: 1.51660170e+02 -7.78580612e+00 9.44696273e+01 -7.97735644e-05 2.39753693e-04 7.33504704e+01
1716.lowfreq: -4.7204 -3.4531 0.0007 0.0007 0.0010 11.3629 24.8164 31.0765 44.8255
frequency: 24.7835 30.9322 44.7982 57.2804 68.2871 84.4928 94.7761 183.2271 231.4148 240.2522 247.7869 253.3774 271.7993 316.4291 336.9300 448.0606 457.4702 492.9790 522.2918 601.3696 646.6002 728.8987 734.1753 775.1294 795.8378 814.1172 827.4218 898.7245 905.8909 921.0208 1012.6781 1047.7791 1082.2436 1115.7041 1124.7058 1164.6330 1164.7256 1172.9837 1219.3936 1226.8161 1255.2558 1255.3375 1349.4990 1349.6616 1390.4369 1390.7036 1429.0151 1435.4519 1471.1198 1471.3922 1481.8520 1481.8801 1493.8747 1495.6336 1519.5152 1526.2386 1645.7886 1653.9245 2881.9141 2881.9777 2984.6107 2984.6980 3038.5524 3038.6451 3080.2069 3080.2766 3102.2515 3102.2576 3355.0938 3355.3563 3416.7399 3416.7726
redmass: 3.3887 4.3971 2.2469 1.8199 2.7582 4.6250 6.7947 3.9785 1.5906 1.1566 1.8583 3.7836 3.2979 4.8268 5.4122 2.9553 4.6262 8.8828 3.1527 1.7880 2.0803 1.1456 1.0978 8.2362 2.2169 1.1130 1.5992 1.9511 1.6586 4.1684 4.6122 3.1051 3.4691 1.8907 1.6861 2.3336 2.1751 5.4170 2.1294 2.2607 1.1478 1.1436 1.3323 1.3316 1.2352 1.2329 1.2251 1.1639 1.0541 1.0540 1.0436 1.0453 1.1718 1.1235 1.5839 1.5666 7.2931 9.4269 1.0718 1.0719 1.0378 1.0378 1.0887 1.0887 1.0974 1.0974 1.1005 1.1005 1.0764 1.0755 1.0758 1.0758
irintensity: 4.2989 1.0145 0.2893 1.9768 2.1724 2.2482 4.5366 32.7453 0.2584 4.2424 3.6711 2.0331 6.6997 0.0122 12.0771 20.7548 6.6857 11.0637 4.0822 136.5576 43.8679 22.3879 195.8039 8.4428 35.8594 3.3343 15.0390 4.5478 7.4689 2.7930 9.4300 1.8325 27.6445 0.1495 47.1319 35.1605 7.1776 8.1354 0.0505 14.0262 3.9234 1.5491 6.5552 1.7475 26.6455 0.4242 71.6093 4.0237 31.3304 14.7397 13.9638 6.5849 2.3665 2.1335 0.0653 226.6456 409.1069 1.7954 172.9798 23.1823 53.8601 4.0891 5.9313 18.3370 14.7533 86.5756 14.4016 40.8607 45.3037 0.2150 0.4346 0.0947
temp: 298.150 k
press: 1.00000 atm
elementType: 8 8 7 7 7 7 6 6 6 6 6 6 1 1 1 1 1 1 1 1 1 1 1 1 1 1
symmnumber: 1
zpe: 563465.9 jmol-1
zpe.correction: 0.214613 hartree
zpe.thermalcorrener: 0.229257 hartree
zpe.thermalcorrenthalpy: 0.230201 hartree
zpe.thermalcorrgfe: 0.170359 hartree
zpe.sumelectzpe: -605.472258 hartree
zpe.sumelectthermal: -605.457613 hartree
zpe.sumelectthermalent: -605.456669 hartree
zpe.sumelectthermalfe: -605.516512 hartree
dipole: 0.0001 0.0001 0.0909
dipole: 0.0909
quadrupole: -45.2302 -83.8306 -68.2034
quadrupole: -12.8582 -0.0006 -0.0008
quadrupole: 20.5245 -18.0759 -2.4487 -12.8582 -0.0006 -0.0008
hfenergy: -605.6868705 hartree
pointgroup: C01 [X(C6H14N4O2)]
dipole: -0.0000273 -0.0357732 -0.0000256 debye
dipolederiv: -0.729567 -0.0021329 -0.0386107 0.0151762 -0.3375968 -0.0091391 0.3505697 -0.0461927 -0.9495737 -0.7295635 0.0021033 -0.0386144 -0.0150579 -0.3375779 0.0088992 0.3506074 0.0459571 -0.9496005 -0.1743353 0.1271503 0.0333931 0.1336952 -0.073398 -0.107626 0.1351612 -0.1346577 -0.4622549 -0.1743859 -0.1271567 0.0334692 -0.1336362 -0.0733042 0.1074377 0.1351786 0.1344704 -0.4623911 -0.599544 0.0122805 0.4223011 0.133681 -0.4420495 0.0124042 0.2398584 -0.0216658 -0.3405346 -0.5994822 -0.0121117 0.4223007 -0.1336209 -0.4420435 -0.0123202 0.2399403 0.0217398 -0.3405236 0.2386195 -0.1547082 -0.1279225 -0.3378271 0.3875371 0.1203096 -0.1956181 0.0543597 0.4661175 0.2386289 0.1546583 -0.1279998 0.3377487 0.3874925 -0.1202773 -0.1957912 -0.0543426 0.4662174 -0.1063845 0.0595673 -0.0274839 0.1065299 0.0613862 -0.0234324 0.0046673 -0.0353082 0.0328305 -0.1063831 -0.0595802 -0.0274533 -0.1065248 0.061411 0.0234217 0.0047165 0.0352988 0.0328109 1.0870555 -0.0095136 -0.3252092 0.0095325 0.1996271 -0.0120718 -0.7168331 0.0758501 1.0988776 1.0869888 0.0094206 -0.3252094 -0.009795 0.199602 0.0124135 -0.7168475 -0.0755133 1.0989038 0.0044072 -0.0952235 0.0301703 -0.0278547 -0.1110013 0.018343 0.0502917 0.0475921 0.0380752 -0.0197967 0.0395357 -0.036841 0.0786247 0.0078714 0.0066121 0.0477342 -0.0793933 -0.2853289 0.0044072 0.095236 0.0301295 0.0278655 -0.1110433 -0.018279 0.0502815 -0.0475295 0.0381006 -0.0197985 -0.0395493 -0.0368281 -0.0786033 0.0079016 -0.0067405 0.0477717 0.0792678 -0.2853653 -0.0123315 -0.0461069 0.0200229 0.0035152 0.0398317 0.0109578 0.1167784 0.1144723 0.2568059 -0.0123387 0.0461113 0.0199983 -0.0034602 0.0397777 -0.0108508 0.1168018 -0.1143537 0.2568683 0.0289572 -0.0702728 0.0135758 -0.1405453 -0.1090996 0.0732017 0.0225748 0.0891205 0.0595845 0.0979521 -0.0098897 0.0091095 -0.0315282 0.1065912 -0.0099568 -0.0544398 0.0067274 -0.133188 -0.0305156 0.095475 0.0359263 0.1301609 -0.0502212 -0.0669365 0.0504674 -0.0750824 0.0805232 0.0289628 0.070276 0.0135439 0.1405532 -0.1091751 -0.0731283 0.0225108 -0.0890455 0.059656 0.0979502 0.0098941 0.0091009 0.031505 0.1065922 0.0098491 -0.0544586 -0.0068343 -0.1331912 -0.0305123 -0.095458 0.0359697 -0.1301378 -0.0501556 0.0669961 0.0505294 0.0751419 0.0804575 0.2155029 0.025148 -0.0084258 -0.0828881 0.3205182 -0.0153149 -0.0512079 0.0022324 0.1380656 0.2155065 -0.025153 -0.0084132 0.0828913 0.3205261 0.0152282 -0.0512451 -0.0023114 0.1380574 unknown
polarizability: 151.1924753|-0.0006508|73.3504711|-9.3352966|0.0038223|94.9373215 unknown
InChI: InChI=1S/C6H14N4O2/c1-3-7-9-5(11)6(12)10-8-4-2/h7-10H,3-4H2,1-2H3
charge 0 multiplicity 1
26 atoms
O  0.646609 -0.09876 1.684703
O  -0.646565 -0.099461 -1.684991
N  3.076273 -0.157838 0.057781
N  -3.076223 -0.157991 -0.05804
N  1.748213 -0.094426 -0.417922
N  -1.748172 -0.094348 0.417631
C  3.860108 -1.287398 -0.498848
C  -3.860054 -1.287302 0.499077
C  5.311842 -1.196979 -0.000937
C  -5.311795 -1.197088 0.001149
C  0.657195 -0.099275 0.418335
C  -0.657152 -0.099478 -0.418622
H  3.394717 -2.226301 -0.149741
H  3.8437 -1.303692 -1.616623
H  -3.394678 -2.226363 0.150372
H  -3.843634 -1.303116 1.61686
H  3.548541 0.753408 -0.034621
H  -3.548503 0.753294 0.033891
H  5.807067 -0.274863 -0.361257
H  5.340024 -1.198425 1.102124
H  5.897378 -2.057093 -0.369518
H  -5.807003 -0.274805 0.361066
H  -5.339998 -1.199029 -1.10191
H  -5.897332 -2.05703 0.370128
H  1.530931 -0.107022 -1.429496
H  -1.53089 -0.106518 1.42921
