program: Gaussian 09
title: 000037203
version: EM64L-G09RevD.01
frameworkgroup: C1[X(C11H13N3O3)]
method: RPBEPBE
basis: SDD
operation: Freq
keyword: #p
keyword: freq=noraman
keyword: PBEPBE/SDD
title: #p freq=noraman PBEPBE/SDD
converged: YES YES NO NO
title: Mulliken charges:
elementType: O O O N N N C C C C C C C C C C C H H H H H H H H H H H H H
charge: -0.305138 -0.305338 -0.287298 -0.462447 -0.083719 -0.380074 0.367457 0.019080 -0.499743 0.132445 -0.495782 0.250599 0.228058 0.255183 -0.528470 -0.527988 -0.776117 0.373595 0.261788 0.269730 0.343957 0.256889 0.226866 0.219328 0.227138 0.220792 0.250887 0.262236 0.262463 0.223623
chargesum: 0.00000
title: Mulliken charges with hydrogens summed into heavy atoms:
elementType: O O O N N N C C C C C C C C C C C
charge: -0.305138 -0.305338 -0.287298 -0.088852 -0.083719 -0.036117 0.367457 0.019080 -0.237955 0.132445 -0.226052 0.250599 0.228058 0.255183 0.174613 0.170828 -0.027794
polarizability: 2.80193235e+02 -1.48318436e+00 1.41075027e+02 -5.50640214e-01 6.72865635e+00 8.12299718e+01
1716.lowfreq: -4.7584 -0.0005 -0.0005 -0.0001 1.3158 8.5072 36.9558 49.1001 72.0818
frequency: 36.8714 49.0983 72.0799 81.9867 99.7327 106.1138 123.0636 143.2710 163.2842 173.0579 207.2864 236.3762 263.3882 289.9311 317.7609 327.3789 377.1330 387.3837 431.2589 443.2857 465.8930 499.2517 577.2640 583.9243 636.4249 658.3622 700.1676 700.9286 727.9052 748.7199 751.6109 760.1165 791.4202 843.7866 865.2689 885.6308 920.1610 939.8122 950.5257 986.5002 1017.0184 1041.7793 1085.8783 1111.7984 1113.5634 1135.6609 1151.3745 1157.8763 1179.5763 1209.0285 1215.7745 1240.5252 1302.7821 1361.4042 1390.8739 1395.1364 1413.4739 1425.6447 1448.6021 1448.7332 1456.4651 1459.3265 1468.9692 1470.6001 1478.3232 1481.8381 1486.5314 1556.6238 1581.0992 1600.2886 1647.3118 2967.8494 2971.0779 3000.7595 3064.9117 3070.1559 3097.9240 3106.5052 3116.9118 3119.7060 3168.6041 3179.2813 3482.2938 3551.1896
redmass: 1.3975 2.1551 4.9777 3.2689 2.9110 4.3815 4.4759 2.4830 1.1671 1.2126 4.1751 4.9329 7.0778 4.5383 5.3625 5.4747 6.8323 4.7149 4.6523 5.0958 5.3465 4.5372 4.8192 3.5373 4.5888 1.3708 6.5831 4.1263 6.5120 7.0986 3.0404 5.0731 1.1180 3.7354 1.6237 1.5284 6.7447 5.9083 5.0331 2.3150 2.5281 1.6206 4.9076 1.2604 1.2435 1.6387 1.4569 1.4689 2.6906 1.5486 2.4366 1.9558 9.2814 4.2332 3.6392 1.3447 1.7220 1.2708 2.0401 1.0777 1.0769 1.1685 2.7624 1.1338 1.1654 2.4783 1.0598 4.7014 8.8464 5.9158 7.7710 1.0310 1.0313 1.0361 1.1035 1.1030 1.0977 1.1013 1.1026 1.1031 1.0932 1.0931 1.0830 1.0777
irintensity: 1.6987 0.7656 6.6392 3.2380 10.4603 1.8159 7.6183 3.2719 0.6386 1.5149 6.1035 9.2532 4.0274 5.8157 1.3740 3.2854 5.4138 0.9398 1.9713 6.0146 29.0412 5.6158 6.3027 0.4987 17.2988 73.0059 3.3387 31.3437 6.3261 6.2682 4.3469 23.3261 91.3592 0.5376 30.3434 30.1553 39.6191 20.2566 71.8210 34.6298 1.1592 16.1157 61.0273 34.7974 1.7029 86.7217 6.4665 26.9307 71.4913 11.3759 91.2883 46.6298 3.9789 207.0695 129.6152 7.8264 7.7371 0.4725 110.5370 25.2870 16.9532 6.0349 17.4552 26.3527 3.4669 92.0713 19.1209 384.2357 150.5348 93.6304 54.9548 90.0719 75.9635 10.6857 28.7787 25.8557 5.1883 16.2565 29.7840 27.1706 1.9082 1.4423 177.8317 46.5887
temp: 298.150 k
press: 1.00000 atm
elementType: 8 8 8 7 7 7 6 6 6 6 6 6 6 6 6 6 6 1 1 1 1 1 1 1 1 1 1 1 1 1
symmnumber: 1
zpe: 608626.9 jmol-1
zpe.correction: 0.231814 hartree
zpe.thermalcorrener: 0.248399 hartree
zpe.thermalcorrenthalpy: 0.249343 hartree
zpe.thermalcorrgfe: 0.186947 hartree
zpe.sumelectzpe: -815.644482 hartree
zpe.sumelectthermal: -815.627897 hartree
zpe.sumelectthermalent: -815.626953 hartree
zpe.sumelectthermalfe: -815.689349 hartree
dipole: -2.1813 -0.3363 -0.0301
dipole: 2.2073
quadrupole: -68.5835 -101.6335 -100.6904
quadrupole: 10.6166 2.9272 -5.4973
quadrupole: 21.7190 -11.3310 -10.3879 10.6166 2.9272 -5.4973
hfenergy: -815.8762959 hartree
pointgroup: C01 [X(C11H13N3O3)]
dipole: 0.8668103 -0.0132312 -0.0510093 debye
polarizability: 277.3144238|20.2031111|138.8400448|-3.8627148|17.649504|86.3437644 unknown
InChI: InChI=1S/C11H13N3O3/c1-6(15)12-11-13-7-4-9(16-2)10(17-3)5-8(7)14-11/h4-5,12-13H,1-3H3
charge 0 multiplicity 1
30 atoms
O  -3.548614 1.253959 0.351671
O  -3.517527 -1.56772 -0.261151
O  3.866257 2.161725 0.23319
N  1.419452 1.013125 0.09833
N  1.450208 -1.237676 -0.365839
N  3.577234 -0.104494 -0.216949
C  0.074803 0.610996 0.070494
C  0.112631 -0.798405 -0.222364
C  -1.131549 1.305482 0.27754
C  2.175545 -0.124141 -0.165359
C  -1.093203 -1.524242 -0.342426
C  -2.324913 0.563614 0.173136
C  -2.305949 -0.835999 -0.158052
C  4.373996 1.021568 -0.02045
C  -4.33652 0.812303 1.526972
C  -4.352419 -1.190901 -1.425215
C  5.872686 0.800604 -0.12622
H  1.855574 1.926142 0.268237
H  -1.183974 2.370274 0.520205
H  -1.102057 -2.590416 -0.582099
H  4.00078 -1.012587 -0.419444
H  -4.571551 -0.264735 1.458541
H  -5.258541 1.41332 1.503959
H  -3.775388 1.018491 2.45853
H  -5.252117 -1.821973 -1.358973
H  -3.811271 -1.404616 -2.366886
H  -4.626101 -0.120973 -1.382649
H  6.348714 1.090825 0.826301
H  6.280707 1.463817 -0.908238
H  6.149608 -0.240866 -0.360891
