program: Gaussian 09
title: 000037126
version: EM64L-G09RevD.01
frameworkgroup: C1[X(C5H11N3O2)]
method: RPBEPBE
basis: SDD
operation: Freq
keyword: #p
keyword: freq=noraman
keyword: PBEPBE/SDD
title: #p freq=noraman PBEPBE/SDD
converged: YES YES NO NO
title: Mulliken charges:
elementType: O O N N N C C C C C H H H H H H H H H H H
charge: -0.418035 -0.244858 -0.120545 -0.669560 -0.413090 -0.371312 -0.473436 -0.654256 0.205657 0.189613 0.269956 0.222713 0.322487 0.233869 0.234396 0.242458 0.226595 0.315220 0.316319 0.214018 0.371793
chargesum: 0.00000
title: Mulliken charges with hydrogens summed into heavy atoms:
elementType: O O N N N C C C C C
charge: -0.046243 -0.244858 -0.120545 -0.038021 -0.199072 0.121356 0.082920 0.049194 0.205657 0.189613
polarizability: 1.04997846e+02 -2.07728842e-02 8.16868279e+01 -2.26733571e+00 2.04369924e+00 6.37622168e+01
1716.lowfreq: -7.5842 -0.0009 -0.0007 -0.0003 1.0704 7.1021 29.0339 42.7133 58.1885
frequency: 28.9918 42.5754 58.1751 84.7018 116.4547 135.0960 186.7798 282.9023 321.3754 369.2400 384.6455 423.1952 441.2243 497.4398 512.0636 557.0446 596.6348 641.9176 674.6843 711.6447 762.2961 777.6396 882.8809 995.4474 1021.6119 1036.7904 1050.5422 1068.4899 1082.8662 1112.5646 1152.6834 1233.3148 1246.7081 1250.1895 1324.7895 1329.2230 1381.7956 1411.2611 1438.7829 1448.1431 1462.4767 1480.3785 1497.4219 1605.4607 1635.5884 1659.9839 2943.1808 2987.2855 3016.9466 3023.2102 3046.1929 3082.9171 3094.6183 3393.4407 3506.9298 3536.8479 3687.5036
redmass: 7.0475 1.5475 3.4745 4.4999 2.1159 2.3254 5.3138 3.5345 3.8812 1.5844 1.1939 1.3239 4.1320 2.6684 1.8873 4.2483 4.1124 1.3649 6.5723 1.1679 3.7921 1.3720 4.1576 2.8876 3.0249 1.8871 1.5655 1.3559 2.3556 1.3221 1.3593 1.8479 1.5750 2.2889 1.8183 1.4946 1.4353 1.8653 1.0967 1.1230 1.5045 1.0491 1.1852 1.8941 1.8196 7.9351 1.0420 1.0617 1.0684 1.0874 1.0973 1.0979 1.1025 1.0765 1.0638 1.0458 1.1025
irintensity: 0.4204 5.1481 3.8640 6.9621 5.9657 1.5662 4.5244 4.6947 17.4237 51.3947 42.5114 187.8678 44.1343 21.5445 32.8699 13.4067 24.3781 116.9737 10.7911 99.8535 5.8470 32.0253 6.0566 48.7299 128.3971 11.0181 32.6201 124.7060 145.2547 4.7798 42.9918 6.0209 5.6906 3.7334 98.6686 67.4823 68.6081 85.9097 9.8433 38.1410 51.3807 11.6796 54.0254 233.9542 185.0749 223.1731 90.4251 38.8267 42.0240 25.3112 9.3488 16.4237 10.1674 18.9612 13.8667 17.5586 21.4876
temp: 298.150 k
press: 1.00000 atm
elementType: 8 8 7 7 7 6 6 6 6 6 1 1 1 1 1 1 1 1 1 1 1
symmnumber: 1
zpe: 447015.7 jmol-1
zpe.correction: 0.170259 hartree
zpe.thermalcorrener: 0.182157 hartree
zpe.thermalcorrenthalpy: 0.183101 hartree
zpe.thermalcorrgfe: 0.130792 hartree
zpe.sumelectzpe: -511.027503 hartree
zpe.sumelectthermal: -511.015606 hartree
zpe.sumelectthermalent: -511.014661 hartree
zpe.sumelectthermalfe: -511.066970 hartree
dipole: 3.9064 1.9159 -1.4030
dipole: 4.5716
quadrupole: -41.6820 -57.1490 -67.1015
quadrupole: 0.1626 4.0614 -0.4535
quadrupole: 13.6288 -1.8381 -11.7907 0.1626 4.0614 -0.4535
hfenergy: -511.1977623 hartree
pointgroup: C01 [X(C5H11N3O2)]
dipole: -1.4704989 0.9481318 0.4167595 debye
dipolederiv: -0.8666949 0.006869 -0.5566038 0.010866 -0.4210932 0.0540272 -0.5450765 0.0446991 -0.7922765 -0.7157184 0.0593091 0.2129002 0.0688132 -0.3180983 -0.0578093 0.0012761 -0.0236906 -0.9730526 -0.8720948 -0.2293699 0.0510806 -0.197497 -0.9760858 0.2194299 0.167481 0.1939487 -0.4177824 -1.1960637 0.1308671 0.0678441 0.1777015 -0.4882511 -0.2760238 0.1563069 -0.2675654 -0.5382213 -0.4365436 0.3875009 -0.059525 0.0898197 -1.1627279 0.1172458 -0.0405107 0.1301152 -0.5363022 0.7058498 0.0112574 -0.0437614 -0.0523477 0.1338434 -0.0334938 -0.014409 -0.0625113 0.254473 -0.534012 0.0326953 0.0911166 -0.0599379 0.078031 0.0464088 0.2020673 0.0536894 -0.1529901 0.0829299 -0.1762562 0.0854995 -0.1079204 0.579928 -0.0781042 0.1036517 -0.0532992 0.2266791 1.5172053 0.0306259 -0.1971319 0.1361216 1.5727806 -0.2955641 -0.231042 -0.3565164 0.2301179 1.5400041 -0.1399707 0.1635229 -0.1573963 0.2037412 0.0314131 0.2150279 0.0222987 1.4778749 0.0506422 -0.0021247 -0.0173148 0.0511988 -0.0042054 -0.103433 -0.039269 -0.0473659 0.026023 -0.0025313 -0.0418231 0.0293737 -0.0629348 -0.0489392 0.1268472 -0.0067516 0.1036705 0.0108573 0.2553335 0.0104251 0.0228703 0.1314795 0.04782 0.0505089 0.0046148 0.0376024 0.0887688 0.0607813 0.0119016 -0.0135758 0.0208506 -0.0079595 -0.1180771 -0.0497588 -0.0876983 0.0166817 -0.0567273 -0.1444466 -0.0886193 -0.0766816 -0.0435945 -0.0094816 -0.0738463 -0.0480384 0.0774161 -0.010049 0.093734 0.1119343 0.0242465 0.0821444 0.0178367 0.0984178 -0.0292974 0.0000898 0.050609 0.0853885 -0.067442 0.0545264 -0.1034223 0.0795608 -0.0980137 0.1655011 -0.1031089 0.1568942 0.0789934 0.0334557 0.0464872 0.1924098 0.1212416 -0.0319043 0.1609052 0.2803176 0.1958269 0.0123364 0.0188624 -0.0101378 0.1536374 0.1057986 0.014072 0.0870074 0.3279658 -0.0757737 -0.2586983 0.0609603 -0.1252314 0.1549866 0.0253853 0.0117156 0.0078966 0.2680875 0.1501326 0.0407856 0.0945533 0.037974 0.3750546 -0.0237172 0.1559508 -0.0313516 0.2283818 unknown
polarizability: 104.6684574|-2.151663|80.11817|-3.6797707|-5.4554414|65.6602636 unknown
InChI: InChI=1S/C5H11N3O2/c1-8(5(6)7)3-2-4(9)10/h6,9H,2-3,7H2,1H3
charge 0 multiplicity 1
21 atoms
O  3.401667 -0.220465 1.042647
O  2.881491 -0.280847 -1.218104
N  -1.257939 0.628963 -0.231852
N  -3.427112 -0.078826 0.39537
N  -1.542289 -1.624639 0.364771
C  0.096406 0.305209 -0.713387
C  1.081962 0.045146 0.450022
C  -1.581017 2.042025 0.009028
C  -2.075999 -0.425236 0.187253
C  2.49567 -0.163029 -0.032145
H  0.042009 -0.602852 -1.335401
H  0.449612 1.136631 -1.350547
H  0.734943 -0.865727 0.976756
H  1.075862 0.865833 1.191735
H  -0.682239 2.579272 0.366471
H  -2.353691 2.131586 0.791277
H  -1.936782 2.559217 -0.906694
H  -3.864319 0.685185 -0.116312
H  -4.036611 -0.758828 0.841441
H  -2.248771 -2.367353 0.510917
H  4.316248 -0.382764 0.682753
