program: Gaussian 09
title: 000037144
version: EM64L-G09RevD.01
frameworkgroup: C1[X(C15H8F6O)]
method: RPBEPBE
basis: SDD
operation: Freq
keyword: #p
keyword: freq=noraman
keyword: PBEPBE/SDD
title: #p freq=noraman PBEPBE/SDD
converged: YES YES NO NO
title: Mulliken charges:
elementType: F F F F F F O C C C C C C C C C C C C C C C H H H H H H H H
charge: -0.136523 -0.153838 -0.148106 -0.145303 -0.128940 -0.146302 -0.182763 0.202337 0.250466 0.394920 -0.375265 0.052236 -0.339426 -0.433728 -0.429822 -0.239887 -0.355909 0.198354 -0.254798 -0.241161 0.281827 0.276257 0.282599 0.243216 0.248705 0.245103 0.243143 0.312368 0.240965 0.239274
chargesum: 0.00000
title: Mulliken charges with hydrogens summed into heavy atoms:
elementType: F F F F F F O C C C C C C C C C C C C C C C
charge: -0.136523 -0.153838 -0.148106 -0.145303 -0.128940 -0.146302 -0.182763 0.202337 0.250466 0.394920 -0.092665 0.052236 -0.096210 -0.185023 -0.184719 0.003256 -0.043540 0.198354 -0.013833 -0.001887 0.281827 0.276257
polarizability: 2.47582338e+02 7.74852271e+00 1.99531434e+02 -5.42386434e+00 2.67064697e+01 9.24209520e+01
1716.lowfreq: -4.2221 -0.0008 0.0003 0.0007 1.7663 7.0507 15.9672 29.9348 38.7703
frequency: 15.7528 29.9129 38.7377 52.0515 62.1171 96.2361 127.3737 148.7117 151.5037 179.9653 202.0139 219.7568 235.0193 272.1427 280.2907 309.0661 338.3979 348.5558 401.8518 425.0752 425.9699 451.7867 464.3117 469.5223 478.4321 504.8605 524.8157 540.7093 585.1598 606.7245 613.5433 647.7523 667.7933 671.8256 708.6033 751.1630 764.0685 787.1467 789.1646 823.6907 837.5974 882.5652 903.8803 916.8513 950.0728 964.3772 972.7454 989.3466 998.3186 1004.2055 1009.2104 1029.1066 1035.5427 1056.7857 1080.5585 1109.3836 1134.7021 1153.9427 1179.9946 1191.5312 1223.4347 1239.6302 1251.5972 1288.1905 1353.3686 1373.1738 1405.3191 1410.8066 1439.0509 1452.2045 1518.6412 1526.7350 1583.1845 1587.5562 1627.8632 1656.4966 3122.6405 3129.3788 3131.7066 3141.8899 3151.1585 3158.4033 3169.7603 3172.0393
redmass: 10.7101 6.5481 11.1397 10.6532 15.4028 5.4226 14.1519 10.4375 9.6488 4.5472 5.8276 8.2753 5.6113 16.0152 15.3150 16.7655 7.4048 6.0520 3.7021 7.6766 9.7525 7.2326 15.4641 3.5667 10.1612 5.6905 6.0270 5.0999 8.6768 8.9171 3.9397 5.8520 9.4685 4.5462 5.4855 1.4959 5.7487 2.3286 3.6048 1.5672 4.9474 1.8302 6.3723 1.9092 1.4580 3.1342 1.8280 3.9658 1.4897 1.5420 5.6994 2.8017 11.6977 2.8445 5.7273 2.6309 4.7813 1.3957 1.1013 1.2569 2.4210 1.8734 2.2940 2.3127 2.1869 2.5107 2.9072 7.4306 2.3515 2.3405 3.9109 9.2541 7.5977 5.2310 6.5235 9.3167 1.0892 1.0878 1.0879 1.0885 1.0908 1.0937 1.0988 1.0997
irintensity: 0.2032 0.2460 0.0254 0.7158 0.1816 2.0697 2.8752 0.4891 1.5162 3.2347 1.0595 0.8553 7.0327 0.1637 0.7121 0.7101 4.2388 9.6124 5.4732 8.8215 6.2067 11.0433 2.9049 0.1492 4.7572 2.9829 6.8432 12.4435 22.9544 40.5926 3.7209 4.9340 0.5668 2.8706 20.5079 16.8670 5.9712 45.9930 21.7071 50.2702 20.1588 32.7552 85.5094 27.2400 0.5544 8.8216 16.1492 2.3265 1.5118 3.8998 11.7842 4.8454 412.2654 10.5830 173.4779 8.9067 413.8448 19.6382 2.2654 14.1673 131.8703 5.7038 280.1797 91.6027 66.8280 16.0434 13.0148 20.7339 6.9639 18.1993 8.9513 302.3375 19.8424 5.0798 3.7727 12.9676 1.5951 0.5166 5.7272 2.0114 4.6739 32.0041 22.0207 12.8102
temp: 298.150 k
press: 1.00000 atm
elementType: 9 9 9 9 9 9 8 6 6 6 6 6 6 6 6 6 6 6 6 6 6 6 1 1 1 1 1 1 1 1
symmnumber: 1
zpe: 506777.2 jmol-1
zpe.correction: 0.193021 hartree
zpe.thermalcorrener: 0.211830 hartree
zpe.thermalcorrenthalpy: 0.212774 hartree
zpe.thermalcorrgfe: 0.143615 hartree
zpe.sumelectzpe: -1249.100309 hartree
zpe.sumelectthermal: -1249.081500 hartree
zpe.sumelectthermalent: -1249.080556 hartree
zpe.sumelectthermalfe: -1249.149715 hartree
dipole: 7.1903 2.1001 -1.0423
dipole: 7.5629
quadrupole: -113.9544 -123.0604 -127.6286
quadrupole: -0.7667 -0.6636 6.1972
quadrupole: 7.5934 -1.5126 -6.0808 -0.7667 -0.6636 6.1972
hfenergy: -1249.2933302 hartree
pointgroup: C01 [X(C15H8F6O1)]
dipole: -2.8649361 0.2277139 0.7705475 debye
polarizability: 247.2674724|1.2851507|204.0547401|-15.7344991|9.9344667|88.2125114 unknown
InChI: InChI=1S/C15H8F6O/c16-14(17,18)13(15(19,20)21)8-12(22)11-7-3-5-9-4-1-2-6-10(9)11/h1-8H
charge 0 multiplicity 1
30 atoms
F  4.260042 0.952699 1.071453
F  2.408359 1.193911 2.357565
F  2.747406 2.582455 0.606506
F  3.524984 1.088315 -1.664618
F  3.597611 -1.129976 -1.221662
F  1.768911 -0.220513 -2.220968
O  0.773349 -2.363671 -0.551745
C  -2.127225 -0.086748 0.067832
C  -1.344913 -1.302858 -0.05181
C  -3.563805 -0.210905 0.248069
C  -1.994625 -2.554206 -0.076893
C  0.14622 -1.353972 -0.106022
C  -1.580113 1.236244 -0.027909
C  -4.170786 -1.508575 0.254767
C  -4.367498 0.968283 0.390344
C  -3.40228 -2.662205 0.074485
C  0.948204 -0.256715 0.557399
C  2.126973 0.270652 0.132733
C  -2.388391 2.368967 0.113125
C  -3.792901 2.238811 0.337066
C  2.880242 1.233964 1.024427
C  2.74491 -0.010661 -1.224557
H  -1.376533 -3.45103 -0.189411
H  -0.520251 1.37604 -0.257892
H  -5.255948 -1.581667 0.394232
H  -5.448588 0.853129 0.53119
H  -3.874914 -3.649203 0.067724
H  0.576173 0.059771 1.541258
H  -1.94219 3.36602 0.034485
H  -4.413024 3.134443 0.445828
