program: Gaussian 09
title: 000037142
version: EM64L-G09RevD.01
frameworkgroup: C1[X(C12H5F6NO)]
method: RPBEPBE
basis: SDD
operation: Freq
keyword: #p
keyword: freq=noraman
keyword: PBEPBE/SDD
title: #p freq=noraman PBEPBE/SDD
converged: YES YES NO NO
title: Mulliken charges:
elementType: F F F F F F O N C C C C C C C C C C C C H H H H H
charge: -0.133941 -0.151616 -0.146966 -0.137104 -0.131651 -0.149620 -0.165304 0.005385 0.209604 0.344567 -0.321347 0.065681 0.295842 0.273767 -0.313054 -0.337578 -0.366601 -0.358969 0.400152 -0.246192 0.292057 0.248744 0.286411 0.268448 0.269285
chargesum: 0.00000
title: Mulliken charges with hydrogens summed into heavy atoms:
elementType: F F F F F F O N C C C C C C C C C C C C
charge: -0.133941 -0.151616 -0.146966 -0.137104 -0.131651 -0.149620 -0.165304 0.005385 0.209604 0.344567 -0.029290 0.065681 0.295842 0.273767 -0.064311 -0.051167 -0.098153 -0.089684 0.400152 -0.246192
polarizability: 2.26341213e+02 1.63336379e+01 1.30468085e+02 -1.36998432e+01 -1.78371111e+01 8.87656960e+01
1716.lowfreq: -4.9945 -4.2940 -0.0004 -0.0002 0.0007 2.7975 15.9272 28.1102 38.8246
frequency: 15.5114 28.0975 38.7601 46.2897 51.6451 77.0401 110.5588 126.6694 149.0232 163.6091 200.9452 222.6478 232.0587 265.2661 283.7838 311.5951 336.9039 386.6834 398.8389 418.9048 439.0047 458.5858 465.7493 497.2186 521.5523 541.6334 559.7055 573.9621 604.2111 633.6759 638.2727 665.9082 700.4550 719.1687 769.0786 793.7503 857.8259 873.7754 894.1976 907.4692 985.1592 986.0916 997.5637 1006.3713 1008.3152 1033.8431 1037.4205 1087.8197 1120.5495 1140.3372 1188.1745 1202.2801 1226.9607 1259.4352 1307.7071 1348.8060 1366.1591 1412.2931 1492.5193 1545.2082 1575.5940 1616.9728 1670.7557 2181.5731 3118.0421 3142.0833 3155.8801 3171.3887 3176.0880
redmass: 13.6257 15.1828 4.6393 16.8485 9.7859 9.9676 13.8463 10.8025 15.4103 12.5775 8.4833 8.9094 6.2679 15.4547 17.7053 18.2566 8.1246 6.3090 2.9286 16.2026 10.4081 7.5412 17.0845 8.7797 6.4467 8.4245 4.2185 6.7916 9.4523 7.1313 7.0211 7.8240 8.3708 4.4508 4.6571 6.3247 1.3568 1.7014 2.3392 3.6880 7.8137 1.4525 6.9736 1.4317 3.2005 4.5603 11.7811 10.6815 1.3851 4.9947 1.3447 2.5357 2.7496 4.4924 1.2904 2.2691 5.4248 3.7263 2.4743 9.1459 8.9056 6.2457 10.1014 12.6316 1.0884 1.0895 1.0889 1.0964 1.0982
irintensity: 0.2668 0.2316 0.2322 0.0425 0.7311 6.0408 1.1750 7.1727 1.7087 2.5513 0.6260 2.7284 4.4554 1.1809 1.2161 0.5517 0.5945 1.1678 0.0355 1.8089 18.9514 1.4747 2.9071 11.0076 14.9799 3.4500 22.3683 35.8820 16.4730 18.7173 9.1763 0.4419 34.7332 6.7313 1.4167 15.5847 26.7200 105.2139 22.5686 56.1313 17.5843 5.2007 67.7128 0.3933 1.8473 57.1718 376.3616 170.3518 7.6089 298.3146 27.4496 8.4264 211.6626 377.8454 10.5195 72.4937 16.8459 31.3368 3.4072 151.1880 102.5732 16.1570 25.2588 5.6482 6.1371 5.3272 0.3708 2.6279 1.6953
temp: 298.150 k
press: 1.00000 atm
elementType: 9 9 9 9 9 9 8 7 6 6 6 6 6 6 6 6 6 6 6 6 1 1 1 1 1
symmnumber: 1
zpe: 380062.1 jmol-1
zpe.correction: 0.144758 hartree
zpe.thermalcorrener: 0.162958 hartree
zpe.thermalcorrenthalpy: 0.163903 hartree
zpe.thermalcorrgfe: 0.095118 hartree
zpe.sumelectzpe: -1187.843130 hartree
zpe.sumelectthermal: -1187.824930 hartree
zpe.sumelectthermalent: -1187.823986 hartree
zpe.sumelectthermalfe: -1187.892771 hartree
dipole: -1.1230 -0.5918 -2.2092
dipole: 2.5479
quadrupole: -144.1870 -115.3592 -114.2854
quadrupole: -10.1712 4.0056 1.8471
quadrupole: -19.5764 9.2513 10.3251 -10.1712 4.0056 1.8471
hfenergy: -1187.9878885 hartree
pointgroup: C01 [X(C12H5F6N1O1)]
dipole: 0.4975219 0.4766525 -0.7281113 debye
dipolederiv: -0.9414601 -0.1163966 0.0919553 -0.0382868 -0.3983074 0.0153666 0.0947368 0.0183851 -0.274252 -0.3930685 0.0891618 -0.049597 0.1350086 -0.4489813 0.2376511 -0.0309928 0.1976977 -0.6483832 -0.4559416 0.053852 -0.007358 0.1757569 -0.595959 -0.2837397 0.0149953 -0.2314872 -0.5022924 -0.40741 0.0562135 0.1526324 0.0265786 -0.3738508 -0.0632566 0.3261342 -0.1540624 -0.6875556 -0.561668 -0.2279766 -0.050352 -0.4072102 -0.5567038 0.0152675 0.0264599 -0.0021307 -0.3610311 -0.7942698 0.1280424 -0.0387403 0.1597369 -0.3773996 0.1096959 -0.0095467 0.1097801 -0.3382577 -0.959778 0.0041284 -0.0716335 -0.2178566 -0.5765393 -0.3476837 -0.387401 -0.2006719 -0.5379714 -0.2779239 -0.0105242 -0.0134638 -0.0171889 -0.212396 0.0059002 -0.0245482 0.0062517 -0.2249356 -0.5320553 0.0733639 0.02098 0.0549585 -0.2613349 -0.0226194 0.1255067 -0.0326283 -0.3189809 -0.9298034 -0.1266653 -0.2894742 -0.0365012 -0.029022 -0.0458929 -0.307678 -0.059403 -0.124572 -0.0371049 0.0076219 -0.0823859 0.0012525 -0.1127624 -0.0115042 -0.2679621 -0.0102968 0.09707 2.1075999 0.010496 0.2853627 0.1786028 0.5942236 0.3925919 0.6656813 0.2657113 0.5398691 1.9430379 -0.1024526 -0.0081939 -0.4562115 1.5429291 0.0955691 0.0294565 0.0541485 1.3893557 1.7044703 0.0880501 -0.0311591 0.3419561 1.3605744 -0.1337019 -0.354154 -0.0039646 1.5100958 0.1600532 -0.128204 -0.0181466 0.1176407 -0.0411772 0.0607177 0.1325707 0.0051211 -0.0489432 0.0575875 0.1691384 0.1559284 -0.1313977 0.0033524 0.0399697 -0.0452311 0.0978454 -0.0139339 -0.2813726 0.0923002 0.0342925 0.0628641 0.0081863 0.1022542 -0.0033766 0.1297743 -0.0528479 -0.0497575 -0.2053633 -0.1038508 -0.1242146 -0.0691337 0.0108606 -0.0582851 -0.017534 -0.1557737 0.1906207 -0.0173282 0.0060393 -0.0232073 0.2161821 0.040808 -0.0005149 0.0435409 0.1725146 0.1274161 0.0385622 0.0485015 0.0422811 -0.0223229 -0.0228904 0.0559155 -0.0224518 0.0258818 0.1116932 0.0156995 0.0193526 0.0064338 0.0977861 0.0237638 0.0289565 0.0300643 0.1018733 0.0030423 0.0835404 0.009909 0.1038908 0.068048 -0.0378289 0.0365937 -0.0323421 0.1083097 0.1297123 -0.0323177 -0.0386517 0.0003684 0.070122 -0.054407 -0.0100305 -0.063607 0.1088714 0.0829521 -0.0129469 -0.0281409 -0.0176239 0.0404666 -0.0852396 -0.0344704 -0.0879422 0.0984874 0.003428 0.0700049 0.0061942 0.0623686 0.0740194 -0.041652 -0.0028158 -0.0397985 0.1374018 unknown
polarizability: 226.3101178|1.3355646|113.3881128|23.2919526|25.5466865|105.8767634 unknown
InChI: InChI=1S/C12H5F6NO/c13-11(14,15)10(12(16,17)18)5-9(20)8-3-1-7(6-19)2-4-8/h1-5H
charge 0 multiplicity 1
25 atoms
F  -4.490571 0.748185 -0.009942
F  -3.240723 1.985062 -1.445998
F  -3.056711 2.315003 0.785342
F  -2.668355 -0.19538 2.163082
F  -3.124039 -1.792024 0.619704
F  -0.977816 -1.375772 1.215225
O  -0.224425 -1.702888 -1.955017
N  6.352268 0.543729 1.362918
C  -2.109467 0.279252 -0.147526
C  1.365426 -0.407938 -0.658774
C  -1.097584 0.31238 -1.048758
C  0.022349 -0.696768 -1.231244
C  -3.216184 1.312365 -0.203577
C  -2.221948 -0.758484 0.948033
C  1.597509 0.728828 0.160535
C  2.434279 -1.29997 -0.947938
C  2.879448 0.976686 0.682684
C  3.715988 -1.060804 -0.429392
C  3.946683 0.082502 0.389772
C  5.260683 0.33422 0.922239
H  -1.130946 1.093978 -1.820993
H  0.778261 1.41674 0.397247
H  2.233612 -2.172329 -1.578118
H  3.064129 1.849148 1.31612
H  4.542235 -1.744023 -0.646723
