program: Gaussian 09
title: 000037138
version: EM64L-G09RevD.01
frameworkgroup: C1[X(C14H12F6O4)]
method: RPBEPBE
basis: SDD
operation: Freq
keyword: #p
keyword: freq=noraman
keyword: PBEPBE/SDD
title: #p freq=noraman PBEPBE/SDD
converged: YES YES NO NO
title: Mulliken charges:
elementType: F F F F F F O O O O C C C C C C C C C C C C C C H H H H H H H H H H H H
charge: -0.138193 -0.154629 -0.148895 -0.142022 -0.136927 -0.146471 -0.299246 -0.307275 -0.269542 -0.177337 0.435858 0.051867 0.273054 0.256661 -0.490555 -0.545217 0.044609 -0.322303 0.215537 0.285878 0.269044 -0.526985 -0.525495 -0.492900 0.263045 0.302106 0.285327 0.235878 0.222085 0.273070 0.237608 0.249596 0.226864 0.249100 0.236165 0.210641
chargesum: 0.00000
title: Mulliken charges with hydrogens summed into heavy atoms:
elementType: F F F F F F O O O O C C C C C C C C C C C C C C
charge: -0.138193 -0.154629 -0.148895 -0.142022 -0.136927 -0.146471 -0.299246 -0.307275 -0.269542 -0.177337 0.435858 0.051867 0.273054 0.256661 -0.227511 -0.243111 0.044609 -0.036976 0.215537 0.285878 0.269044 0.204048 0.188573 0.203006
polarizability: 2.53038094e+02 3.43930288e+00 1.80358799e+02 1.32080372e+01 1.34952833e+01 1.19138209e+02
1716.lowfreq: -6.1090 -4.6993 0.0001 0.0003 0.0005 3.4102 14.8244 17.5781 25.5662
frequency: 14.4788 17.4745 25.5636 26.9724 44.3294 46.3473 63.6577 92.0325 104.8371 115.1140 131.2642 135.4685 146.2594 149.9742 153.6847 171.8458 181.5496 203.5022 216.4888 224.9481 251.8025 265.2203 282.9251 284.3070 311.9756 316.6954 343.0360 364.8488 398.3861 418.4665 426.9214 441.7655 464.6345 470.7632 490.0952 511.4084 541.9377 577.1315 588.7242 605.2026 623.9044 644.3278 664.2345 679.4335 708.3944 756.1785 765.2112 854.7335 864.7413 882.0714 897.1280 902.3764 921.9459 933.4565 972.4957 985.9291 1003.3209 1032.1625 1037.9475 1055.2310 1084.6317 1108.0681 1111.2866 1113.5612 1138.9831 1145.7046 1150.4247 1156.4368 1169.9431 1209.5720 1212.8939 1230.4733 1311.6717 1350.4215 1373.9007 1397.0736 1416.3634 1436.2722 1445.8200 1453.1273 1456.1202 1458.5457 1461.7670 1465.9671 1476.3011 1487.3897 1546.1162 1569.9590 1603.6565 1666.1641 2975.6023 2980.0118 2987.3731 3072.8089 3085.0045 3097.3570 3119.2510 3127.0626 3131.9996 3132.6501 3157.7792 3172.4890
redmass: 7.4442 4.7795 7.6601 5.2089 10.6104 15.9506 4.2401 3.5080 6.3963 3.6439 3.6291 3.9743 5.7895 1.2738 1.2522 4.4174 2.5678 1.8374 8.4495 3.1203 4.5612 13.4746 5.9515 9.2847 17.9236 6.0207 5.1071 5.8336 6.9180 15.3072 7.4188 8.1389 13.9839 11.7360 7.5471 6.9990 5.3624 7.2297 7.9918 4.6515 7.3172 5.7486 7.6523 7.2854 6.5370 3.5748 7.4629 8.9575 6.1958 1.7127 2.3806 2.5987 1.9557 9.3196 10.3755 6.2457 9.7161 12.4572 4.9777 2.6406 7.3514 1.2421 1.2475 1.2377 3.5745 1.8106 1.3582 1.5025 3.2514 2.2805 1.5348 3.1375 6.8528 2.3148 5.9755 3.1565 1.3901 1.3016 1.3739 1.5765 1.0781 1.0873 1.3234 1.0509 1.0625 1.0532 9.9027 8.5159 6.9054 10.1225 1.0307 1.0320 1.0332 1.1048 1.1019 1.0990 1.0883 1.1026 1.1053 1.1049 1.0921 1.0919
irintensity: 0.1812 2.6663 0.8021 1.4249 0.6202 0.0722 2.1623 0.6606 4.5218 2.8332 8.1003 2.9536 1.4996 1.2331 0.7321 0.0576 1.2596 4.5391 2.7643 5.4577 12.9951 3.1164 12.0209 4.3307 0.4989 0.1488 3.1927 1.6564 5.3033 2.2662 10.0284 11.1267 4.0453 12.5576 3.4558 3.1901 5.9960 25.8332 75.6390 3.7354 11.6974 32.0654 0.2432 24.1183 17.9745 5.9844 6.5389 19.0256 15.7299 28.5020 28.2210 111.6790 11.6633 84.0390 59.7051 24.2938 28.7314 361.2828 183.8930 113.4415 175.8826 2.0428 34.1070 2.2495 151.9502 126.4063 13.2178 35.8173 53.7992 17.1393 33.8926 319.3721 577.4661 80.4750 136.8321 95.8353 4.7815 29.7993 51.7048 39.6689 19.4679 24.4562 28.1696 17.2464 9.9496 24.6582 283.9914 106.7340 2.5072 31.1110 69.4105 67.0204 66.2893 24.9021 20.0447 39.7528 4.1989 19.5094 12.9116 19.9129 0.7944 4.4168
temp: 298.150 k
press: 1.00000 atm
elementType: 9 9 9 9 9 9 8 8 8 8 6 6 6 6 6 6 6 6 6 6 6 6 6 6 1 1 1 1 1 1 1 1 1 1 1 1
symmnumber: 1
zpe: 628370.1 jmol-1
zpe.correction: 0.239334 hartree
zpe.thermalcorrener: 0.264440 hartree
zpe.thermalcorrenthalpy: 0.265384 hartree
zpe.thermalcorrgfe: 0.180461 hartree
zpe.sumelectzpe: -1438.758575 hartree
zpe.sumelectthermal: -1438.733469 hartree
zpe.sumelectthermalent: -1438.732525 hartree
zpe.sumelectthermalfe: -1438.817447 hartree
dipole: 7.9191 3.3315 -0.3108
dipole: 8.5969
quadrupole: -125.9011 -140.0096 -136.0475
quadrupole: 3.8368 11.4299 -6.0237
quadrupole: 8.0849 -6.0235 -2.0614 3.8368 11.4299 -6.0237
hfenergy: -1438.9979087 hartree
pointgroup: C01 [X(C14H12F6O4)]
dipole: 3.2086702 1.0664266 0.0841601 debye
polarizability: 252.5921059|-4.672218|175.6504032|16.0703432|20.2933222|124.2925926 unknown
InChI: InChI=1S/C14H12F6O4/c1-22-9-4-7(5-10(23-2)12(9)24-3)8(21)6-11(13(15,16)17)14(18,19)20/h4-6H,1-3H3
charge 0 multiplicity 1
36 atoms
F  -5.263707 0.716049 0.018627
F  -4.101728 1.605798 -1.71704
F  -3.806238 2.415418 0.374676
F  -3.322811 0.26561 2.243542
F  -3.849534 -1.627747 1.115015
F  -1.678312 -1.105062 1.491485
O  4.513733 0.38832 0.431126
O  2.398176 2.303759 0.679763
O  3.827881 -2.270898 -0.699593
O  -1.13479 -2.123322 -1.594435
C  0.549208 -0.605641 -0.716491
C  3.197047 0.05031 0.07015
C  2.141945 1.011143 0.167737
C  2.913914 -1.244192 -0.474793
C  0.827403 0.687705 -0.199617
C  1.59093 -1.55104 -0.863128
C  -0.821328 -0.991901 -1.11969
C  -1.928731 0.048667 -1.084992
C  -2.887947 0.219518 -0.141303
C  -4.002868 1.218605 -0.360344
C  -2.933671 -0.552265 1.157537
C  4.718927 0.754923 1.858131
C  3.226657 3.163566 -0.201807
C  5.142723 -2.317127 -0.032427
H  0.049751 1.448491 -0.079988
H  1.373345 -2.545603 -1.263101
H  -2.01303 0.645512 -2.00414
H  5.771371 1.067429 1.927527
H  4.540716 -0.128995 2.499145
H  4.044376 1.577358 2.149111
H  3.336772 4.114525 0.34029
H  4.214948 2.705136 -0.386066
H  2.704636 3.335129 -1.161655
H  5.801702 -1.51026 -0.387539
H  5.545097 -3.303392 -0.309602
H  5.032737 -2.253531 1.065987
