program: Gaussian 09
title: 000037087
version: EM64L-G09RevD.01
frameworkgroup: C1[X(C9H13NO)]
method: RPBEPBE
basis: SDD
operation: Freq
keyword: #p
keyword: freq=noraman
keyword: PBEPBE/SDD
title: #p freq=noraman PBEPBE/SDD
converged: YES YES NO NO
title: Mulliken charges:
elementType: O N C C C C C C C C C H H H H H H H H H H H H H
charge: -0.284201 -0.575736 -0.161444 -0.271740 -0.684873 0.376318 -0.350931 -0.384512 -0.223604 -0.198024 -0.259121 0.223315 0.240609 0.188116 0.212137 0.195922 0.246440 0.260692 0.280433 0.250386 0.246611 0.221719 0.225264 0.226225
chargesum: 0.00000
title: Mulliken charges with hydrogens summed into heavy atoms:
elementType: O N C C C C C C C C C
charge: -0.284201 -0.034611 0.061871 0.156985 -0.030373 0.376318 -0.100545 -0.137901 -0.001885 0.027240 -0.032896
polarizability: 1.49464744e+02 -2.17909517e+00 1.05386359e+02 -3.74537737e+00 -6.23809593e+00 6.28732525e+01
1716.lowfreq: -9.9118 -4.8044 -0.0001 0.0002 0.0002 6.2191 46.1448 52.5821 101.7712
frequency: 46.0374 52.5366 101.7632 141.0067 189.6909 225.1961 236.8015 249.3470 311.2038 397.7739 411.5087 427.6350 492.8284 503.8992 577.5173 610.6022 624.9640 693.0042 758.4313 792.1948 823.2592 839.0416 888.5651 919.4966 953.8554 960.9006 974.2460 980.8495 985.3951 1021.2848 1027.6886 1082.4928 1116.8746 1163.7022 1167.1823 1175.0844 1180.4246 1220.9688 1249.8271 1313.9560 1324.0867 1343.2911 1372.9146 1380.6671 1391.5675 1443.1052 1459.9344 1470.8046 1478.9642 1483.8967 1590.9512 1612.0689 1641.3770 2948.7534 2970.2122 3015.1168 3041.3160 3067.7617 3090.6133 3126.5665 3135.5049 3154.5656 3164.0219 3172.2676 3452.2024 3582.3618
redmass: 3.9823 3.2389 3.6701 2.3353 1.1800 2.8466 4.2785 1.1887 3.8724 2.2615 2.8399 2.2500 3.3097 2.8545 6.6614 6.4188 1.4837 2.0490 1.6540 5.9235 1.2808 2.5334 1.4501 1.2854 1.6076 1.3591 4.0387 1.3012 5.6139 1.9358 1.5975 1.5342 2.4749 1.4159 1.1270 1.6760 1.2228 3.4366 1.4038 1.3358 1.3462 1.2681 1.4927 1.5623 3.0524 2.3600 1.0708 1.3415 1.0650 1.5876 6.3920 6.2437 1.0943 1.0606 1.0372 1.0852 1.1020 1.0984 1.0993 1.0846 1.0891 1.0928 1.0951 1.1001 1.0455 1.0967
irintensity: 1.2788 0.5683 0.7998 2.2195 61.8835 5.0196 1.4323 0.1231 9.9428 10.5168 0.8425 7.6855 6.1850 12.3157 2.1377 0.7345 232.9577 34.6820 91.8652 10.5022 0.4874 5.8268 8.7282 3.4025 1.9043 0.3101 58.0460 0.7163 19.8437 7.1803 27.5971 15.5999 12.0648 49.8918 0.9947 37.9387 12.9147 219.6399 0.5557 1.1159 4.1666 3.5472 10.5903 21.6439 8.2391 2.1870 15.4471 94.1775 10.7984 30.8429 22.9609 83.3226 37.2047 35.1750 26.5831 7.4932 40.8252 61.1437 32.1917 2.4230 13.5602 32.5102 24.4155 4.1977 0.9698 1.4514
temp: 298.150 k
press: 1.00000 atm
elementType: 8 7 6 6 6 6 6 6 6 6 6 1 1 1 1 1 1 1 1 1 1 1 1 1
symmnumber: 1
zpe: 531165.5 jmol-1
zpe.correction: 0.202310 hartree
zpe.thermalcorrener: 0.213575 hartree
zpe.thermalcorrenthalpy: 0.214519 hartree
zpe.thermalcorrgfe: 0.164800 hartree
zpe.sumelectzpe: -479.873885 hartree
zpe.sumelectthermal: -479.862620 hartree
zpe.sumelectthermalent: -479.861676 hartree
zpe.sumelectthermalfe: -479.911395 hartree
dipole: 1.7632 -0.3543 0.7259
dipole: 1.9394
quadrupole: -52.6828 -64.5277 -69.3711
quadrupole: 0.3041 0.9476 -3.3522
quadrupole: 9.5111 -2.3338 -7.1772 0.3041 0.9476 -3.3522
hfenergy: -480.0761951 hartree
pointgroup: C01 [X(C9H13N1O1)]
dipole: -0.692623 0.1459674 0.2849307 debye
dipolederiv: -1.9680134 0.1054137 -0.054333 0.0559918 -0.319444 -0.0104704 -0.0902323 -0.0047881 -0.2841605 -0.613167 0.0326199 0.0531604 0.1138878 -0.7800158 0.2696946 0.002374 0.2355264 -0.3054693 0.5707148 -0.1587337 -0.0064127 -0.04182 0.4596521 -0.1270389 -0.0317741 -0.0904162 0.2598033 0.7816645 -0.1580673 -0.0091447 -0.6118266 0.3010659 0.0006459 -0.0820786 0.0315219 0.3623592 -0.0551412 0.0013267 0.046836 0.0158652 -0.1560788 0.1222992 -0.0165194 0.1593984 -0.0060683 1.6431844 0.0544403 0.0759308 0.3324972 0.0616602 0.0097269 0.1673378 -0.0038498 0.1182739 -0.3318189 0.0146987 0.0075925 -0.3555719 -0.0754351 0.0082978 -0.0734137 0.0261717 -0.2143082 -0.4236772 -0.0280494 -0.0106849 0.2132169 0.0275837 0.0549311 0.0302225 0.0400209 -0.1859245 0.1499788 -0.0726405 0.00416 0.0501954 0.149169 0.0567785 0.0286219 0.0475023 -0.1313591 0.1652734 0.0258569 0.0249404 -0.0171526 0.1496585 0.0527096 0.0178445 0.0560582 -0.1337123 -0.0459761 0.0554429 0.0246834 0.0076069 -0.2174457 -0.0011241 0.0110091 0.0022135 -0.2043959 0.0409236 0.0140559 -0.013583 -0.0045651 0.0059735 -0.04858 -0.0090359 -0.0514454 -0.1416068 -0.0109392 -0.0560954 0.0498036 0.0542182 -0.0725673 0.0908792 0.0513842 0.0955579 -0.0318886 -0.0222739 0.0029497 -0.0246452 0.1111287 -0.0044703 -0.0662505 0.0269314 -0.106459 -0.1401625 -0.1741238 -0.1260357 -0.025936 -0.1086146 0.0444935 0.0046604 -0.0427285 -0.0108328 0.064564 0.0976709 -0.0149655 -0.0092473 0.0069801 0.01853 -0.1242809 0.0157431 -0.0526512 -0.1406301 0.0433808 0.1452286 -0.004703 0.1575156 -0.0436797 0.012471 -0.0108681 -0.0015296 0.0845353 0.1781666 0.0884284 0.0009992 0.0547748 0.3008409 -0.0126214 0.039565 -0.0993937 0.0038656 -0.0148204 0.0313618 -0.0813119 -0.0883363 0.2384348 -0.1252209 0.0147414 -0.1080648 0.2383399 0.0167957 0.1010597 0.0069466 0.1148893 0.0028575 -0.0252299 0.0093155 -0.0237033 0.1634991 0.0759227 -0.0728442 -0.0211915 -0.0610719 -0.0376279 -0.04256 -0.0189113 -0.0416562 0.1607179 0.0453583 -0.0623354 -0.0179268 -0.0840754 -0.0946621 -0.0511321 -0.0225671 -0.0506415 0.1443402 -0.0132511 0.1079969 0.0098938 0.1158508 -0.0419707 -0.0295774 0.0097229 -0.0295951 0.1508213 -0.1358322 -0.0311129 -0.0258267 -0.0315845 0.0834778 -0.0190075 -0.0266842 -0.0189443 0.1685664 unknown
polarizability: 149.3570723|-2.9294494|105.2837764|4.1369802|6.7561271|63.0835067 unknown
InChI: InChI=1S/C9H13NO/c1-8(10)7-11-9-5-3-2-4-6-9/h2-6,8H,7,10H2,1H3
charge 0 multiplicity 1
24 atoms
O  -0.653285 -0.50554 -0.300893
N  -4.001383 1.10659 -0.28938
C  -3.038872 -0.018805 -0.349457
C  -1.635296 0.582497 -0.150944
C  -3.324147 -1.162947 0.653262
C  0.705614 -0.188768 -0.150524
C  1.198226 1.111983 0.125107
C  1.603699 -1.276862 -0.29347
C  2.593254 1.309671 0.256489
C  2.989297 -1.062825 -0.159733
C  3.494866 0.23224 0.116696
H  -3.075834 -0.427442 -1.377177
H  -1.463831 1.367779 -0.911568
H  -1.544755 1.032134 0.861864
H  -4.317407 -1.609062 0.462129
H  -3.313925 -0.777576 1.692108
H  -2.558066 -1.95409 0.57634
H  -4.184905 1.438164 0.664367
H  -4.870617 0.942425 -0.804764
H  0.519322 1.962702 0.234602
H  1.195674 -2.269887 -0.506873
H  2.971564 2.316302 0.468528
H  3.677594 -1.908218 -0.271336
H  4.572814 0.395234 0.219627
