program: Gaussian 09
title: 000037163
version: EM64L-G09RevD.01
frameworkgroup: C1[X(C16H24N2O)]
method: RPBEPBE
basis: SDD
operation: Freq
keyword: #p
keyword: freq=noraman
keyword: PBEPBE/SDD
title: #p freq=noraman PBEPBE/SDD
converged: YES YES NO NO
title: Mulliken charges:
elementType: O N N C C C C C C C C C C C C C C C C H H H H H H H H H H H H H H H H H H H H H H H H
charge: -0.254917 -0.109602 -0.351905 -0.353133 -0.401973 -0.420945 -0.366395 -0.417782 -0.446655 0.087164 -0.229150 0.488540 -0.451782 -0.374957 -0.208548 -0.236727 -0.224141 -0.689775 -0.243171 0.197132 0.216296 0.225626 0.197691 0.192397 0.214094 0.207761 0.190325 0.217926 0.251602 0.225193 0.211483 0.204156 0.214164 0.231378 0.286453 0.231932 0.162164 0.223938 0.223933 0.196046 0.220772 0.237176 0.226221
chargesum: 0.00000
title: Mulliken charges with hydrogens summed into heavy atoms:
elementType: O N N C C C C C C C C C C C C C C C C
charge: -0.254917 -0.109602 -0.137741 0.053357 -0.003888 -0.007518 0.056922 0.051747 -0.009979 0.087164 -0.024995 0.488540 -0.220404 -0.088504 0.185548 -0.012789 -0.000208 -0.035782 -0.016950
polarizability: 1.78080702e+02 1.85669200e+00 2.04422548e+02 2.84110317e+00 4.99182270e+00 1.73330478e+02
1716.lowfreq: -9.4106 0.0001 0.0004 0.0005 5.4370 11.7453 14.4240 35.0202 41.5745
frequency: 12.7033 34.7171 41.2121 60.4553 68.5147 72.8593 97.9715 136.2956 161.4884 189.9463 210.3205 221.1799 243.6182 255.5032 261.4302 298.4018 304.5857 312.1620 363.8086 375.4345 405.7169 434.2097 471.7213 485.1591 507.9025 529.6057 577.9114 607.9931 618.9311 672.8420 706.6176 737.1456 762.7314 780.3656 794.7887 810.8127 818.6407 837.8836 841.3017 859.3510 864.5220 874.6679 893.0564 911.7130 935.6158 969.7441 981.5828 988.3428 990.8481 997.7480 1000.5296 1007.1933 1026.6946 1055.8638 1060.0686 1079.0795 1092.9686 1103.6785 1114.1980 1128.8029 1132.4325 1165.3217 1170.8597 1183.2994 1185.5821 1192.5720 1203.2887 1242.3305 1249.6006 1257.2733 1265.4221 1281.2146 1289.7129 1323.3631 1329.5112 1334.2870 1337.8236 1344.6303 1351.0954 1357.5074 1367.0516 1368.8825 1386.0550 1388.2637 1400.8997 1441.1405 1454.8397 1456.9574 1462.0378 1465.8484 1470.4082 1477.1382 1479.8622 1481.8363 1488.0761 1490.3869 1575.8640 1594.7748 1612.4016 2912.4053 2917.8450 2930.3819 2958.7908 2973.7830 2974.8198 2979.3915 2986.2809 2990.6626 3019.2784 3021.3245 3028.0339 3031.1347 3036.9932 3047.7773 3078.7421 3087.4448 3100.3188 3107.5438 3123.6988 3136.8797 3149.7223 3161.9563 3354.1820
redmass: 3.8173 3.7089 2.8682 2.6411 3.8502 4.0154 2.3752 2.9888 3.7011 3.4580 2.0029 2.0850 2.0786 3.0196 4.0745 2.0206 3.9746 3.9064 3.2306 3.0293 2.8390 2.7364 2.9619 1.9956 2.4342 3.3617 3.9860 3.3623 4.3194 4.8988 1.7805 2.5237 1.9509 1.4815 2.2247 1.5150 1.1325 2.9071 2.5431 1.2468 2.7013 1.8322 2.0596 2.1631 1.5997 2.2335 1.3714 2.4369 4.3070 1.8018 1.5701 2.0448 2.1907 4.5682 2.0739 1.6004 1.5767 1.9561 2.1883 2.1009 1.4368 2.1279 1.0622 1.2422 1.1197 1.7836 1.6045 1.3162 1.2136 1.6044 1.4412 1.3621 1.4866 1.2707 1.2542 1.2943 1.4045 1.4738 1.4060 1.4027 1.4537 1.3456 3.7106 1.5386 1.5782 2.1628 1.0854 1.0418 1.0818 1.0921 1.1111 1.1673 1.0626 1.9892 1.0861 1.1047 4.9146 6.1003 6.0984 1.0683 1.0799 1.0706 1.0621 1.0617 1.0615 1.0629 1.0631 1.0357 1.0974 1.0946 1.0984 1.1018 1.1019 1.1005 1.0909 1.0987 1.1009 1.0879 1.0863 1.0917 1.0957 1.1012 1.0746
irintensity: 0.4157 0.2075 0.1656 0.3701 0.5249 1.2279 3.7263 2.5872 2.7992 0.8005 0.1767 0.4145 2.4661 2.3699 0.2032 1.3803 1.9086 0.6444 2.4952 0.9685 0.1775 4.9389 4.3242 3.5700 1.1734 4.4108 11.2929 6.8567 4.6112 3.8049 55.1648 15.8956 41.2737 62.6652 10.7458 10.7296 1.9291 1.0884 5.0787 0.2578 16.3344 6.6993 9.3156 4.1603 6.4022 9.8805 0.4485 4.2103 1.3742 26.4666 5.6962 8.9900 10.7268 183.4222 2.5375 9.1050 17.7317 29.7023 9.4575 2.0227 20.5336 55.7737 0.3376 3.1378 1.8114 10.7614 25.4880 0.5914 24.3671 36.3915 2.7383 24.2768 14.6975 13.2755 2.0554 8.7375 38.4101 9.9881 8.2493 0.0381 18.4714 1.3171 5.9215 3.0553 64.1863 9.8328 12.5399 10.7557 7.1547 9.8875 25.1672 7.3527 2.9255 9.4042 12.5819 16.3354 113.9372 1.0395 2.1350 42.3215 60.2712 75.9984 32.3834 19.7818 26.9981 45.0256 50.3699 36.7926 53.3933 20.5743 41.2482 27.1692 27.2483 91.2967 11.0095 40.8659 32.7673 10.5899 1.4877 24.9921 16.9098 28.6714 39.4699
temp: 298.150 k
press: 1.00000 atm
elementType: 8 7 7 6 6 6 6 6 6 6 6 6 6 6 6 6 6 6 6 1 1 1 1 1 1 1 1 1 1 1 1 1 1 1 1 1 1 1 1 1 1 1 1
symmnumber: 1
zpe: 976334.6 jmol-1
zpe.correction: 0.371866 hartree
zpe.thermalcorrener: 0.390818 hartree
zpe.thermalcorrenthalpy: 0.391762 hartree
zpe.thermalcorrgfe: 0.322868 hartree
zpe.sumelectzpe: -807.328216 hartree
zpe.sumelectthermal: -807.309264 hartree
zpe.sumelectthermalent: -807.308320 hartree
zpe.sumelectthermalfe: -807.377214 hartree
dipole: 4.3059 0.0298 2.3549
dipole: 4.9079
quadrupole: -116.6877 -107.4279 -110.3627
quadrupole: -3.1603 -3.5644 -2.3182
quadrupole: -5.1949 4.0649 1.1300 -3.1603 -3.5644 -2.3182
hfenergy: -807.7000821 hartree
pointgroup: C01 [X(C16H24N2O1)]
dipole: -1.5826496 0.8527573 -0.7045685 debye
polarizability: 182.7768828|9.482512|199.5405775|-1.3782117|-7.1513274|173.5162679 unknown
InChI: InChI=1S/C16H24N2O/c1-2-19-15(14-10-6-5-7-11-14)16(17)18-12-8-3-4-9-13-18/h5-7,10-11,15,17H,2-4,8-9,12-13H2,1H3
charge 0 multiplicity 1
43 atoms
O  1.465128 -2.226409 -0.373491
N  -1.86726 -0.509025 -0.193305
N  -0.608901 -1.820901 1.430158
C  -2.655214 2.385215 0.035333
C  -3.581984 1.864125 1.164001
C  -2.789833 1.594843 -1.293216
C  -3.248578 0.448963 1.691321
C  -1.8705 0.350877 -1.403085
C  -3.123162 -0.622056 0.57604
C  -0.718582 -1.160597 0.29199
C  0.544093 -1.116702 -0.617449
C  1.363589 0.153057 -0.386408
C  1.795885 0.947562 -1.475217
C  1.743652 0.511201 0.930881
C  0.899807 -3.559178 -0.66102
C  2.587202 2.098065 -1.253941
C  2.537082 1.657563 1.152631
C  2.044859 -4.561141 -0.516939
C  2.956817 2.457402 0.062493
H  -3.850616 1.311701 -1.442713
H  -2.527727 2.24807 -2.148965
H  -2.297672 0.474762 2.258088
H  -4.038836 0.135795 2.403666
H  -2.909023 3.446525 -0.154222
H  -1.59915 2.368478 0.372465
H  -3.551406 2.573551 2.014734
H  -4.626791 1.873462 0.787685
H  -2.168223 -0.235009 -2.300589
H  -0.845707 0.718254 -1.56763
H  -3.179732 -1.63764 1.013857
H  -3.974146 -0.542334 -0.12584
H  0.214814 -1.165422 -1.680601
H  -1.461233 -1.797955 2.022851
H  1.530092 0.655914 -2.499882
H  1.420529 -0.126643 1.760745
H  0.087368 -3.769828 0.060433
H  0.482663 -3.570919 -1.69503
H  2.919748 2.705725 -2.103233
H  2.834096 1.926343 2.172915
H  1.684019 -5.589163 -0.706423
H  2.85871 -4.334907 -1.227787
H  2.456544 -4.51678 0.505876
H  3.572279 3.347456 0.236923
