program: Gaussian 09
title: 000037108
version: EM64L-G09RevD.01
frameworkgroup: C1[X(C15H13NO2)]
method: RPBEPBE
basis: SDD
operation: Freq
keyword: #p
keyword: freq=noraman
keyword: PBEPBE/SDD
title: #p freq=noraman PBEPBE/SDD
converged: YES YES NO NO
title: Mulliken charges:
elementType: O O N C C C C C C C C C C C C C C C H H H H H H H H H H H H H
charge: -0.308968 -0.297387 -0.147027 0.052202 0.229879 0.196627 0.416582 0.161947 0.370654 -0.400916 -0.460732 -0.451333 -0.384059 -0.442848 -0.255025 -0.243945 -0.644685 -0.649913 0.255892 0.245015 0.258424 0.323911 0.239774 0.229593 0.227757 0.249709 0.237277 0.248113 0.233432 0.276613 0.233437
chargesum: 0.00000
title: Mulliken charges with hydrogens summed into heavy atoms:
elementType: O O N C C C C C C C C C C C C C C C
charge: -0.308968 -0.297387 -0.147027 0.052202 0.229879 0.196627 0.416582 0.161947 0.370654 -0.145024 -0.215717 -0.192909 -0.060148 -0.203074 -0.025431 -0.016188 0.090414 0.093569
polarizability: 3.05414584e+02 -1.50217474e+01 1.88573200e+02 9.44534383e-02 1.00308216e-01 7.74289341e+01
1716.lowfreq: -19.5730 -6.0788 -4.4324 -0.0007 -0.0004 0.0006 7.1091 41.7493 78.9152
frequency: -18.8728 41.7406 78.9057 101.5479 118.4584 143.6920 146.7784 176.2356 207.5339 240.0417 244.7417 284.4746 328.2576 351.9076 398.7653 406.6616 442.5231 497.9397 502.8577 511.7537 529.0345 546.4924 563.3346 610.8120 633.9200 636.6582 674.9505 719.9302 741.7247 765.6454 790.5822 821.7855 830.7111 837.3618 868.1813 895.7061 919.0951 963.0811 982.1615 992.3673 1017.2630 1020.0742 1034.6382 1064.4413 1097.4409 1134.8220 1135.6740 1150.3013 1159.5802 1172.5069 1204.6737 1231.9373 1238.5176 1253.6932 1277.4323 1323.6973 1367.9488 1388.8933 1399.1762 1420.1062 1429.3203 1432.9921 1440.5873 1452.9305 1469.0826 1484.6185 1486.4534 1491.0102 1517.0187 1548.4827 1574.8744 1601.2052 1625.9535 1641.1642 2962.8719 2970.3563 3038.6054 3039.4570 3109.3138 3118.9312 3133.2029 3135.0590 3142.2104 3155.9871 3170.0014 3171.6975 3200.7996
redmass: 2.0657 4.2883 1.8308 2.1212 2.1864 3.4768 2.9075 2.7169 3.9808 2.8646 4.9275 4.4952 6.0983 6.8534 3.6968 3.3890 3.9850 6.2645 3.3699 8.7955 3.6856 6.7489 5.4729 5.5784 3.3061 8.4164 5.8912 2.8455 6.4739 1.2684 2.9055 2.0052 1.5089 5.0853 5.4109 1.5126 6.0072 1.3407 1.3986 3.4698 3.9122 1.3073 2.3541 1.4659 1.2241 1.7384 1.3433 1.2285 1.8595 1.1136 3.0056 2.0276 2.7147 2.1860 1.9050 2.9351 4.5946 3.4584 3.8619 5.9663 2.4829 1.2517 1.8610 1.4991 1.0422 1.1343 1.0568 1.0980 4.0605 6.5185 7.1452 6.5678 6.4775 6.6974 1.0364 1.0386 1.1022 1.1015 1.0977 1.0867 1.0895 1.0901 1.0949 1.0972 1.0964 1.0970 1.0911
irintensity: 0.2767 5.3422 0.0917 0.0191 0.9166 1.3553 1.7478 0.0491 2.3837 6.4996 3.4446 3.7842 0.0033 0.5777 12.6877 1.9430 0.1300 2.7189 12.7811 0.6649 0.1080 2.3814 0.2653 21.4293 0.3211 4.3381 2.7371 16.5946 2.8863 24.0887 0.0170 24.0443 118.8971 0.5098 25.2713 0.5955 29.4033 0.0832 4.0854 8.9688 14.9257 3.4356 11.8694 48.5988 0.0607 7.3092 1.0496 2.2991 124.5127 20.4200 12.1267 15.3250 15.0223 85.0834 68.0221 51.1874 136.2961 192.8957 3.7260 9.3636 19.4070 17.8171 22.7208 5.6210 22.4562 10.6433 6.1408 25.6282 69.9814 130.4665 56.6669 6.8469 6.4357 830.6818 43.6737 133.8834 49.6043 15.5337 15.5188 1.7148 0.3076 31.8898 3.3395 23.6375 8.1665 45.0584 6.0629
temp: 298.150 k
press: 1.00000 atm
elementType: 8 8 7 6 6 6 6 6 6 6 6 6 6 6 6 6 6 6 1 1 1 1 1 1 1 1 1 1 1 1 1
symmnumber: 1
zpe: 635129.5 jmol-1
zpe.correction: 0.241908 hartree
zpe.thermalcorrener: 0.256420 hartree
zpe.thermalcorrenthalpy: 0.257364 hartree
zpe.thermalcorrgfe: 0.200498 hartree
zpe.sumelectzpe: -783.340249 hartree
zpe.sumelectthermal: -783.325737 hartree
zpe.sumelectthermalent: -783.324792 hartree
zpe.sumelectthermalfe: -783.381659 hartree
dipole: 4.3049 -4.2784 0.0127
dipole: 6.0694
quadrupole: -67.9994 -105.8900 -109.7822
quadrupole: 2.3089 0.0774 -0.0571
quadrupole: 26.5578 -11.3328 -15.2250 2.3089 0.0774 -0.0571
hfenergy: -783.5821566 hartree
pointgroup: C01 [X(C15H13N1O2)]
dipole: 1.6819224 -1.6930468 -0.0815891 debye
polarizability: 305.1485403|-16.0172331|188.3132597|2.5270269|7.2160771|77.9549183 unknown
InChI: InChI=1S/C15H13NO2/c1-16(2)14-9-12(17)15-11-6-4-3-5-10(11)7-8-13(15)18-14/h3-9H,1-2H3
charge 0 multiplicity 1
31 atoms
O  1.833014 -1.05035 -0.02376
O  0.053477 2.72242 0.208919
N  3.959611 -0.151061 0.060866
C  -0.253971 0.289224 0.036286
C  -1.70835 0.255983 0.012112
C  0.421579 -0.94382 -0.037025
C  -2.387874 -1.023589 -0.084917
C  0.564472 1.546598 0.134624
C  2.606949 0.109254 0.065058
C  -0.233582 -2.204051 -0.131987
C  -1.621643 -2.235946 -0.15539
C  2.005374 1.359007 0.143647
C  -2.513266 1.443351 0.080531
C  -3.818958 -1.070745 -0.11025
C  -3.910091 1.362258 0.053593
C  -4.573925 0.101901 -0.042229
C  4.890803 0.983458 0.149349
C  4.520041 -1.511618 0.010205
H  0.37354 -3.111975 -0.184614
H  -2.1494 -3.193698 -0.228839
H  2.609476 2.263946 0.218105
H  -1.997859 2.403755 0.154113
H  -4.312072 -2.047502 -0.184637
H  -4.503299 2.282063 0.107116
H  -5.668466 0.058635 -0.062003
H  4.742406 1.691229 -0.688512
H  5.922231 0.601104 0.102007
H  4.766025 1.537961 1.099819
H  5.178508 -1.626117 -0.871934
H  3.707685 -2.246818 -0.060739
H  5.111063 -1.724958 0.921887
