program: Gaussian 09
title: 000037060
version: EM64L-G09RevD.01
frameworkgroup: C1[X(C16H26N2O3)]
method: RPBEPBE
basis: SDD
operation: Freq
keyword: #p
keyword: freq=noraman
keyword: PBEPBE/SDD
title: #p freq=noraman PBEPBE/SDD
converged: YES YES NO NO
title: Mulliken charges:
elementType: O O O N N C C C C C C C C C C C C C C C C H H H H H H H H H H H H H H H H H H H H H H H H H H
charge: -0.317220 -0.448232 -0.278302 -0.342405 -0.364873 -0.123649 -0.432285 -0.027722 -0.308017 -0.663077 -0.718888 -0.546671 0.472462 0.380838 -0.369039 -0.434328 -0.373950 -0.348611 -0.391424 0.248801 -0.766703 0.215711 0.235290 0.219975 0.191644 0.254619 0.230221 0.236899 0.211414 0.223879 0.202821 0.221416 0.210099 0.218656 0.225246 0.214187 0.220156 0.262241 0.243303 0.236142 0.351281 0.252798 0.246643 0.314457 0.209668 0.251125 0.253406
chargesum: 0.00000
title: Mulliken charges with hydrogens summed into heavy atoms:
elementType: O O O N N C C C C C C C C C C C C C C C C
charge: -0.317220 -0.096951 -0.278302 -0.087786 -0.050416 0.092062 0.022980 0.163922 0.159104 -0.024964 -0.068717 -0.107239 0.472462 0.380838 0.113358 -0.191026 -0.137808 -0.095814 -0.144781 0.248801 -0.052504
polarizability: 2.58826836e+02 -3.45939655e+00 1.77681396e+02 -5.80200030e+00 -1.74176133e+01 1.65695839e+02
1716.lowfreq: -6.0721 -2.2593 -0.0006 -0.0005 0.0003 2.4178 6.3644 10.4285 18.3041
frequency: 6.1918 10.2647 17.6605 23.9843 29.6052 42.9460 49.1992 73.5895 84.2361 96.4927 105.9281 119.5052 131.2224 172.1636 188.4218 198.7475 227.6526 241.5797 276.5269 284.1219 307.1978 314.9380 350.2859 379.0166 385.7660 411.7612 419.7356 428.2901 433.3651 450.8544 460.2195 486.7255 510.4855 546.1881 574.0950 587.1071 605.1417 614.1252 634.2506 663.1572 722.1064 736.1482 799.1666 807.5442 820.3516 822.7783 839.9809 845.0606 908.3175 916.3737 920.7232 928.9710 941.5333 950.4116 956.9484 962.9462 970.4904 989.4112 1002.3600 1005.4259 1030.2432 1041.5947 1078.0384 1087.8065 1102.3436 1106.4676 1118.0055 1134.8175 1155.9846 1177.2494 1180.2847 1185.7542 1211.5338 1218.6007 1219.7459 1229.5539 1232.1774 1250.1953 1264.7884 1303.5750 1310.0347 1320.0924 1332.5034 1337.6722 1349.3459 1355.9656 1369.2097 1374.2556 1379.4108 1382.7345 1385.8665 1389.1773 1416.1988 1450.3402 1450.9252 1457.1746 1458.3921 1463.2452 1466.2202 1466.8100 1467.7571 1476.3717 1485.6217 1488.9215 1490.5363 1502.1703 1582.7412 1620.7783 1621.8702 2864.8198 2933.0278 2972.6178 2978.6644 2982.3177 2987.0895 2992.2685 2994.9779 3031.6529 3056.3567 3057.1230 3059.9054 3064.7738 3075.6697 3075.7093 3080.8106 3088.2723 3096.2169 3099.6775 3120.2326 3125.7221 3160.2390 3164.3160 3437.0928 3531.0811 3548.4892
redmass: 3.8199 3.9106 3.6718 4.2004 3.6266 4.0409 3.7370 1.5336 2.3199 3.7827 3.2004 3.4407 4.8137 3.9695 3.0692 1.4470 1.7737 1.1960 2.7567 3.2393 4.4218 2.7969 2.5288 2.3070 3.3780 2.9599 3.0690 2.0395 1.3147 2.5429 2.6454 3.1226 3.1689 2.3596 1.8931 3.4027 2.7021 1.9706 6.0046 1.4774 3.5215 3.2215 2.1088 2.6043 2.5935 1.5529 1.9087 3.0111 2.8267 1.2055 2.4003 1.9878 1.4234 1.6871 2.3725 1.3806 1.9111 2.0976 2.0214 2.4992 1.8507 1.6486 2.0209 2.8731 3.6741 1.8585 1.3651 2.1131 1.6280 1.3854 1.7583 1.1989 2.0714 1.4323 2.0867 1.4122 1.7965 1.2472 1.8476 1.2943 1.3132 1.3613 1.4510 1.3001 1.3440 1.3403 1.3514 1.3090 1.3711 3.5499 1.2311 1.2142 3.2221 1.0459 1.1250 1.1192 1.1195 1.1146 1.1117 1.0502 1.0846 1.0881 1.0866 1.1701 1.6111 2.3906 7.0280 6.3631 6.3017 1.0826 1.0695 1.0359 1.0356 1.0553 1.0647 1.0615 1.0360 1.0853 1.0999 1.1055 1.0944 1.0992 1.0993 1.0992 1.0999 1.0990 1.0997 1.0989 1.0893 1.0893 1.0946 1.0947 1.0744 1.0652 1.0776
irintensity: 0.1795 1.9067 0.1539 7.5052 1.2139 1.2360 0.4214 3.7439 1.4792 4.4652 2.4532 1.1279 0.3707 5.6105 1.9287 0.5665 5.8254 1.5930 7.1805 0.0822 1.5099 2.8557 1.5412 1.6093 13.8058 0.3698 8.7509 38.0494 103.4442 41.9425 15.8039 9.2972 15.4045 5.2998 98.7729 3.5882 28.8194 20.3261 3.1145 62.3117 1.9068 12.9728 12.7203 4.7505 10.6125 2.0003 37.3121 29.7749 5.4207 4.8695 42.0656 6.4681 4.2880 17.6625 27.9624 0.5208 1.1911 8.3759 51.6957 7.5210 15.4011 10.9901 54.0237 12.0176 12.2705 8.2779 15.9897 22.9386 29.9474 71.0481 60.0682 6.0319 36.8756 33.1763 136.7919 13.7879 62.8899 4.2862 124.0289 3.8617 11.7159 12.7066 8.1996 9.6737 5.2378 14.3566 12.3974 24.8746 44.0841 13.4068 55.1913 27.4902 3.7992 13.2497 23.0194 50.0836 95.2549 1.8794 23.8262 1.7573 24.0402 7.9383 4.9786 96.2783 167.1868 97.6778 10.1089 111.5529 165.9211 87.0637 79.9453 39.1218 16.0739 22.6812 32.3706 38.1597 9.9081 22.8393 22.0718 18.7636 34.0388 41.6124 28.4557 11.8079 28.6278 59.5896 20.6225 14.1558 14.4189 20.2050 11.1376 5.8949 1.1153 13.5339 22.0233
temp: 298.150 k
press: 1.00000 atm
elementType: 8 8 8 7 7 6 6 6 6 6 6 6 6 6 6 6 6 6 6 6 6 1 1 1 1 1 1 1 1 1 1 1 1 1 1 1 1 1 1 1 1 1 1 1 1 1 1
symmnumber: 1
zpe: 1048826.0 jmol-1
zpe.correction: 0.399477 hartree
zpe.thermalcorrener: 0.423389 hartree
zpe.thermalcorrenthalpy: 0.424334 hartree
zpe.thermalcorrgfe: 0.339481 hartree
zpe.sumelectzpe: -958.828019 hartree
zpe.sumelectthermal: -958.804106 hartree
zpe.sumelectthermalent: -958.803162 hartree
zpe.sumelectthermalfe: -958.888014 hartree
dipole: 3.6529 1.9271 0.3063
dipole: 4.1414
quadrupole: -167.6271 -128.7850 -119.6901
quadrupole: 20.1127 -2.5599 -5.1572
quadrupole: -28.9264 9.9157 19.0106 20.1127 -2.5599 -5.1572
hfenergy: -959.2274954 hartree
pointgroup: C01 [X(C16H26N2O3)]
dipole: -1.3822503 0.8624919 0.0160555 debye
polarizability: 258.6384452|-1.0657725|173.1812776|-6.9447464|18.7079039|170.3843489 unknown
InChI: InChI=1S/C16H26N2O3/c1-12(2)18-10-15(20)11-21-16-6-4-14(5-7-16)8-9-17-13(3)19/h4-7,12,15,17-18,20H,8-11H2,1-3H3
charge 0 multiplicity 1
47 atoms
O  -1.974046 -1.288225 -0.23158
O  -4.577253 -2.186013 0.121372
O  6.429287 0.973656 0.165109
N  -4.290793 1.56619 0.49704
N  4.188533 0.669913 -0.399582
C  -4.143468 -0.913464 0.715604
C  -4.510126 0.279904 -0.201332
C  -4.000605 2.752382 -0.359122
C  -2.64615 -0.948985 1.043221
C  -2.539684 2.711191 -0.860328
C  -4.264464 4.031499 0.460896
C  3.767093 -1.806142 -0.587642
C  2.255387 -1.694567 -0.452848
C  -0.574578 -1.403455 -0.234636
C  4.41515 -0.534518 -1.209269
C  1.648061 -1.337109 0.775753
C  1.406075 -1.904335 -1.574771
C  0.246148 -1.188772 0.898538
C  0.009898 -1.763607 -1.474719
C  5.216707 1.340102 0.248943
C  4.791012 2.559377 1.065445
H  -4.70804 -0.83613 1.663235
H  -5.557487 0.13038 -0.546625
H  -3.86363 0.245645 -1.096446
H  -4.673425 2.771017 -1.252795
H  -5.054007 1.768021 1.157331
H  -2.423621 -1.733466 1.792196
H  -2.320639 0.047014 1.39873
H  -1.84685 2.781401 -0.001934
H  -2.318041 1.772399 -1.399275
H  -2.341356 3.553059 -1.549547
H  -3.639111 4.035159 1.373114
H  -5.326222 4.103486 0.766551
H  -4.021461 4.931728 -0.130444
H  4.231765 -1.984582 0.399305
H  4.031366 -2.664973 -1.234895
H  4.015069 -0.375903 -2.229951
H  5.509511 -0.660592 -1.279151
H  2.27812 -1.184385 1.660475
H  1.845571 -2.192069 -2.538075
H  -3.911646 -2.418991 -0.578054
H  -0.186758 -0.917547 1.865667
H  -0.642864 -1.933608 -2.336807
H  3.225201 0.983651 -0.268394
H  3.699927 2.728042 1.072989
H  5.143694 2.43748 2.103883
H  5.287453 3.456443 0.656424
