program: Gaussian 09
title: 000037048
version: EM64L-G09RevD.01
frameworkgroup: C1[X(C14H20N2O2)]
method: RPBEPBE
basis: SDD
operation: Freq
keyword: #p
keyword: freq=noraman
keyword: PBEPBE/SDD
title: #p freq=noraman PBEPBE/SDD
converged: YES YES NO NO
title: Mulliken charges:
elementType: O O N N C C C C C C C C C C C C C C H H H H H H H H H H H H H H H H H H H H
charge: -0.311100 -0.286351 -0.439520 -0.128077 0.210983 -0.636624 0.238402 0.223974 -0.379823 0.188069 -0.045884 -0.482019 0.400005 -0.583817 -0.872211 -0.819814 -0.536012 -0.518918 0.251376 0.243236 0.219137 0.214831 0.223963 0.221292 0.331361 0.243814 0.260801 0.290798 0.220800 0.223239 0.218532 0.258020 0.228463 0.219164 0.242007 0.211796 0.224273 0.231833
chargesum: 0.00000
title: Mulliken charges with hydrogens summed into heavy atoms:
elementType: O O N N C C C C C C C C C C C C C C
charge: -0.311100 -0.286351 -0.108158 -0.128077 0.210983 -0.142012 0.238402 0.223974 0.054145 0.188069 -0.045884 -0.036764 0.400005 -0.340003 -0.099811 -0.120024 0.153621 0.148984
polarizability: 2.07116351e+02 -3.58674948e+00 1.91297636e+02 7.85967756e+00 7.32377187e+00 1.20946170e+02
1716.lowfreq: -13.3739 -9.3213 -0.0008 -0.0006 -0.0005 4.5924 40.7144 46.8688 51.0107
frequency: 40.6966 46.8573 50.9929 62.6956 69.8938 91.0089 109.2407 115.3101 136.5841 154.7163 177.1248 196.2402 199.1977 204.4206 224.8934 247.0538 263.7999 287.2695 325.6122 335.6509 367.2492 385.0445 434.4172 472.8221 480.7013 532.2869 543.4599 551.9436 602.1396 612.2454 639.7419 670.8248 723.5320 740.9794 775.8662 818.7282 830.1946 839.2421 886.2056 893.2704 912.2387 947.2207 961.0163 978.3529 997.2259 1031.9248 1040.9339 1043.9451 1049.1826 1065.6931 1079.7258 1084.6064 1112.1558 1112.6495 1150.7405 1157.4967 1163.2325 1168.7308 1197.7690 1209.3677 1217.8557 1268.5630 1276.2086 1288.9855 1308.9676 1314.7115 1366.8441 1393.4894 1394.5605 1400.0338 1435.5722 1439.3853 1447.0557 1452.9016 1456.9868 1460.9863 1462.5885 1464.1754 1468.1415 1470.1403 1476.6578 1481.3488 1489.8133 1495.8172 1504.6721 1587.9593 1597.9278 1604.4007 2952.5030 2957.5312 2961.7655 2969.1104 2974.9779 2993.0564 3023.9142 3026.1162 3036.6963 3049.5177 3051.4771 3056.4161 3057.4595 3096.4116 3100.7062 3104.8556 3107.4651 3118.3029 3148.1498 3547.8152
redmass: 4.2795 3.4791 1.9289 2.4925 2.8887 1.7196 3.1708 2.7276 3.0535 1.0453 2.6688 3.0176 1.3152 1.9764 2.2888 3.5160 1.7853 2.8589 3.7569 4.1449 5.2164 1.9829 4.8075 4.7358 4.5298 1.8892 1.8245 4.3622 3.2825 3.5262 5.3019 4.5760 3.7053 5.2167 3.8000 3.3882 1.4485 1.5614 2.6596 4.3866 4.7939 3.7762 5.3419 2.5636 2.4275 1.9233 2.5669 1.5630 1.7718 2.4370 1.6976 3.8537 1.2602 1.2475 1.4004 1.4689 1.1429 1.4218 4.5240 1.1248 1.5225 1.3629 1.4960 1.3835 2.1663 2.7477 6.2809 1.7513 1.3356 1.4692 1.2867 1.4214 1.9063 1.3979 1.0953 1.1703 1.1870 1.0558 1.1081 1.1126 1.0566 1.1657 1.3161 1.0615 1.1676 7.3376 5.8233 7.2401 1.0314 1.0639 1.0328 1.0408 1.0404 1.0670 1.0628 1.0950 1.1036 1.0946 1.1037 1.0925 1.1043 1.0999 1.0984 1.0981 1.1004 1.1002 1.0906 1.0807
irintensity: 0.6892 0.9154 5.6571 0.9563 2.9596 0.2710 5.2040 3.7794 3.1497 0.2297 1.3934 4.5029 4.8994 3.6340 4.4725 7.2675 0.1718 5.4439 6.7489 1.8776 2.6906 4.8856 4.4266 3.3533 25.9550 65.5302 60.1020 3.7324 11.3051 3.2247 1.1291 16.7756 2.4203 2.4128 0.3648 4.2232 3.6095 22.3063 10.1817 1.0790 14.1905 34.4140 36.2424 8.5610 6.0556 21.3952 8.5467 12.2164 3.8938 88.0298 4.1950 24.6340 0.2045 0.0667 5.0694 29.1177 0.9717 122.9606 60.9692 2.4443 10.5572 13.6413 48.0583 1.8425 8.6041 16.3131 11.9716 30.3016 27.8652 6.2102 3.5851 4.1740 94.6728 2.1636 13.8446 26.7745 39.8009 9.1699 2.3012 18.5692 22.4810 33.3573 43.7990 8.2150 18.4460 14.4524 103.9466 39.1907 69.6701 67.2730 73.4935 26.4055 41.6541 63.3814 15.9283 57.0832 49.6577 6.5090 41.4046 23.8897 50.6321 10.2149 10.6024 2.9562 31.3059 22.6962 12.0414 81.5813
temp: 298.150 k
press: 1.00000 atm
elementType: 8 8 7 7 6 6 6 6 6 6 6 6 6 6 6 6 6 6 1 1 1 1 1 1 1 1 1 1 1 1 1 1 1 1 1 1 1 1
symmnumber: 1
zpe: 831197.4 jmol-1
zpe.correction: 0.316586 hartree
zpe.thermalcorrener: 0.335971 hartree
zpe.thermalcorrenthalpy: 0.336916 hartree
zpe.thermalcorrgfe: 0.268391 hartree
zpe.sumelectzpe: -804.035315 hartree
zpe.sumelectthermal: -804.015930 hartree
zpe.sumelectthermalent: -804.014986 hartree
zpe.sumelectthermalfe: -804.083510 hartree
dipole: 1.6006 4.5566 -0.1837
dipole: 4.8330
quadrupole: -98.3167 -99.1018 -107.6702
quadrupole: -7.2178 -8.9978 2.5063
quadrupole: 3.3795 2.5945 -5.9740 -7.2178 -8.9978 2.5063
hfenergy: -804.3519016 hartree
pointgroup: C01 [X(C14H20N2O2)]
dipole: 0.7067335 1.7645082 -0.0503242 debye
polarizability: 206.9789581|-4.2954493|191.3680147|6.9200933|8.2953079|121.0131843 unknown
InChI: InChI=1S/C14H20N2O2/c1-9-7-12(17-3)11(10(2)14(9)18-4)8-13-15-5-6-16-13/h7,15H,5-6,8H2,1-4H3
charge 0 multiplicity 1
38 atoms
O  -0.734596 2.295755 -0.717211
O  3.06354 -1.698515 0.473069
N  -3.02343 0.530786 0.21479
N  -2.974656 -1.739437 -0.187886
C  -0.033034 0.000592 -0.799864
C  -1.363992 -0.31382 -1.480054
C  -2.474067 -0.550986 -0.476356
C  0.900437 -1.026719 -0.490965
C  -3.946516 0.028558 1.255501
C  0.279807 1.340025 -0.440558
C  2.136546 -0.671855 0.120007
C  -4.037755 -1.49608 0.854865
C  2.457156 0.666804 0.459257
C  1.503809 1.673957 0.177954
C  0.580345 -2.483459 -0.776791
C  3.776134 1.00599 1.128147
C  -0.396177 3.710663 -0.544607
C  3.999219 -2.055095 -0.607124
H  -1.648462 0.529983 -2.133563
H  -1.279873 -1.220549 -2.097354
H  -4.928524 0.534015 1.213859
H  -3.526225 0.165239 2.273234
H  -3.875059 -2.165176 1.71784
H  -5.026136 -1.740267 0.421135
H  -2.581024 1.451465 0.207472
H  1.731629 2.706854 0.458977
H  1.284559 -3.137626 -0.23867
H  -0.449349 -2.730625 -0.462542
H  0.654224 -2.713374 -1.858476
H  4.597846 1.087205 0.389464
H  3.715845 1.970315 1.661739
H  4.063085 0.217287 1.843722
H  0.489561 3.984923 -1.148702
H  -0.208192 3.955298 0.51902
H  -1.276663 4.266045 -0.90165
H  4.621001 -1.185966 -0.900818
H  3.456603 -2.429634 -1.497385
H  4.641586 -2.851677 -0.199875
