program: Gaussian 09
title: 000037044
version: EM64L-G09RevD.01
frameworkgroup: C1[X(C10H15NO)]
method: RPBEPBE
basis: SDD
operation: Freq
keyword: #p
keyword: freq=noraman
keyword: PBEPBE/SDD
title: #p freq=noraman PBEPBE/SDD
converged: NO YES NO NO
title: Mulliken charges:
elementType: O N C C C C C C C C C C H H H H H H H H H H H H H H H
charge: -0.469074 -0.546867 -0.241838 -0.116292 0.443431 -0.720739 -0.441728 -0.380037 0.435241 -0.386966 -0.383678 -0.805546 0.187017 0.233000 0.244357 0.235671 0.192658 0.231149 0.260173 0.292549 0.249433 0.228750 0.228927 0.344622 0.225199 0.224179 0.236411
chargesum: 0.00000
title: Mulliken charges with hydrogens summed into heavy atoms:
elementType: O N C C C C C C C C C C
charge: -0.124452 -0.004885 -0.054821 0.116707 0.443431 -0.048054 -0.210579 -0.119864 0.435241 -0.158216 -0.154751 -0.119757
polarizability: 1.69963792e+02 -4.68590289e+00 9.88817339e+01 4.85969083e+00 1.46244746e+01 9.41727331e+01
1716.lowfreq: -36.4527 -7.4605 -4.1268 0.0001 0.0003 0.0005 11.4024 52.9133 60.5126
frequency: -36.0560 52.8512 60.4551 75.2436 165.7356 179.1219 224.6520 263.5927 289.5565 296.8317 317.9775 333.0276 354.8356 397.7370 410.4118 433.3501 498.2807 538.7301 569.8628 635.8196 715.9096 731.2843 765.4646 815.9237 834.3457 854.0179 864.2431 922.6921 947.2827 962.1337 976.5954 984.6187 1002.4333 1012.4256 1046.7183 1077.4712 1122.5610 1153.0308 1185.9525 1193.7301 1206.5675 1222.2597 1239.8465 1280.4914 1302.1915 1318.2479 1341.6093 1365.9527 1378.2340 1388.4518 1396.5341 1406.8395 1471.4264 1471.9032 1472.1579 1478.0722 1504.8315 1581.2917 1622.3040 1642.9629 2931.5571 2974.5600 2974.7281 2992.6093 3055.6765 3072.1351 3084.3947 3103.6581 3109.8021 3117.8486 3134.2930 3147.2192 3425.6245 3553.1240 3569.0069
redmass: 1.0186 3.5980 3.1311 3.7323 3.8040 4.6655 1.0814 3.0840 1.9276 1.3317 1.3313 2.5215 3.1381 2.8005 2.8750 2.6164 3.7741 2.9067 4.5805 6.8720 1.4973 2.9980 4.1535 1.5295 4.1393 1.2797 1.8089 2.1610 1.9654 1.8090 1.3687 1.4056 1.6377 2.7436 1.5612 1.6504 1.3285 2.0522 1.1826 1.4184 2.0970 2.7840 1.5450 1.5400 1.3712 1.3246 1.5057 1.2613 4.1321 1.2746 1.2242 2.8799 1.0801 1.0535 1.0606 1.0499 2.7069 6.0077 6.3554 1.0921 1.0837 1.0401 1.0417 1.0820 1.0951 1.0937 1.0998 1.1003 1.0870 1.0880 1.0962 1.0958 1.0448 1.0958 1.0662
irintensity: 0.5834 0.8440 0.2358 0.5638 1.6290 1.7903 0.5913 8.9273 53.1300 49.8831 84.4105 22.8291 3.7370 7.9155 1.0059 8.3778 26.4117 20.6600 5.0976 0.9225 331.9617 23.5550 7.0176 51.3129 12.2521 0.5917 15.7717 3.7087 41.0094 22.4323 0.0836 1.0462 14.0096 1.9316 16.5457 37.4699 18.9094 26.9442 2.5958 34.5200 0.5913 0.6902 22.9054 5.5024 13.5828 2.1046 8.3593 3.3495 1.5666 19.5043 9.6346 2.3627 17.7839 12.2188 5.8531 5.8701 31.3285 0.1040 1.1738 49.0903 45.0594 32.9696 24.4566 42.2508 23.8922 38.2969 18.3535 29.4049 10.8702 19.1158 30.7638 5.4799 3.5026 3.6401 4.9773
temp: 298.150 k
press: 1.00000 atm
elementType: 8 7 6 6 6 6 6 6 6 6 6 6 1 1 1 1 1 1 1 1 1 1 1 1 1 1 1
symmnumber: 1
zpe: 601753.4 jmol-1
zpe.correction: 0.229196 hartree
zpe.thermalcorrener: 0.241431 hartree
zpe.thermalcorrenthalpy: 0.242375 hartree
zpe.thermalcorrgfe: 0.190961 hartree
zpe.sumelectzpe: -519.112739 hartree
zpe.sumelectthermal: -519.100505 hartree
zpe.sumelectthermalent: -519.099560 hartree
zpe.sumelectthermalfe: -519.150974 hartree
dipole: -2.3244 0.4015 1.7243
dipole: 2.9219
quadrupole: -73.5549 -71.2568 -71.0612
quadrupole: 1.1848 7.4313 2.4803
quadrupole: -1.5973 0.7009 0.8964 1.1848 7.4313 2.4803
hfenergy: -519.3419353 hartree
pointgroup: C01 [X(C10H15N1O1)]
dipole: 0.920765 -0.2034313 -0.6574661 debye
polarizability: 169.9528754|6.3549191|85.0448368|2.4926593|-9.3394652|108.0205463 unknown
InChI: InChI=1S/C10H15NO/c1-7-3-5-9(6-4-7)10(12)8(2)11/h3-6,8,10,12H,11H2,1-2H3
charge 0 multiplicity 1
27 atoms
O  -2.05975 -1.791322 0.320994
N  -3.922589 0.252339 0.350737
C  -1.612809 -0.528431 -0.323322
C  -2.484964 0.576353 0.365164
C  -0.117459 -0.325796 -0.158572
C  -2.256564 1.955912 -0.277216
C  0.695677 0.048843 -1.256801
C  0.498097 -0.490496 1.110727
C  2.699435 0.112671 0.176089
C  2.081481 0.265301 -1.091563
C  1.882637 -0.275059 1.271316
C  4.184417 0.373774 0.36136
H  -1.870608 -0.552551 -1.406523
H  -2.158852 0.611364 1.423956
H  -2.856725 2.713307 0.254852
H  -1.194129 2.249872 -0.238194
H  -2.572438 1.954159 -1.339953
H  0.242248 0.168845 -2.249102
H  -0.114189 -0.803347 1.964223
H  -4.099685 -0.703868 0.681767
H  -4.360031 0.416547 -0.564759
H  2.692952 0.550333 -1.956649
H  2.340759 -0.41065 2.259096
H  -1.446687 -2.518816 0.046128
H  4.611987 -0.262741 1.156172
H  4.748666 0.185157 -0.568933
H  4.369826 1.426898 0.650105
