program: Gaussian 09
title: 000037070
version: EM64L-G09RevD.01
frameworkgroup: C1[X(C15H23NO4)]
method: RPBEPBE
basis: SDD
operation: Freq
keyword: #p
keyword: freq=noraman
keyword: PBEPBE/SDD
title: #p freq=noraman PBEPBE/SDD
converged: YES YES NO NO
title: Mulliken charges:
elementType: O O O O N C C C C C C C C C C C C C C C H H H H H H H H H H H H H H H H H H H H H H H
charge: -0.278444 -0.224839 -0.193165 -0.237299 -0.092769 -0.380888 -0.311573 -0.385182 -0.252459 -0.695289 -0.683713 0.226772 -0.392091 0.254699 0.190680 -0.318686 -0.336508 -0.260610 -0.246091 -0.537848 0.221585 0.205065 0.207307 0.187317 0.215863 0.222230 0.239323 0.232022 0.213654 0.231052 0.214139 0.217890 0.222582 0.220994 0.236536 0.241695 0.248641 0.242292 0.224298 0.223910 0.250135 0.217855 0.218918
chargesum: 0.00000
title: Mulliken charges with hydrogens summed into heavy atoms:
elementType: O O O O N C C C C C C C C C C C C C C C
charge: -0.278444 -0.224839 -0.193165 -0.237299 -0.092769 0.045761 0.083051 0.052911 0.218886 -0.036444 -0.022247 0.226772 0.086139 0.254699 0.190680 -0.070045 -0.094216 -0.036312 -0.022181 0.149060
polarizability: 2.51338500e+02 5.41359899e-01 1.99024377e+02 -4.85553122e+00 -2.39018428e+00 1.16933712e+02
1716.lowfreq: -6.4189 -0.6057 0.0002 0.0008 0.0010 5.2902 12.4854 23.6470 25.4342
frequency: 9.4887 22.8335 24.9403 30.6110 54.0341 57.6518 71.3963 85.8574 93.7129 114.5351 131.7319 145.6461 161.6517 171.7045 183.8686 219.8938 225.5483 243.1296 251.2231 272.0885 290.2209 300.5883 303.7800 331.6474 400.6331 415.4481 458.6790 485.4027 491.5493 531.1273 544.5612 558.6888 573.1119 580.3759 677.6138 728.3256 733.0746 742.0099 755.7766 771.6278 787.8823 801.6163 810.4444 828.6435 886.2432 896.0350 898.9340 927.3172 955.9781 976.2798 984.0095 1003.3609 1021.1028 1040.1406 1049.5066 1063.1580 1068.1307 1085.0269 1092.0811 1110.6509 1111.4769 1116.6273 1125.1851 1151.4848 1164.1262 1173.8387 1200.9304 1203.6169 1206.6189 1233.4113 1250.9046 1271.9961 1279.6328 1291.6319 1317.5614 1332.5000 1341.7321 1361.4766 1369.7836 1376.5289 1385.9675 1388.0746 1400.0255 1426.1598 1441.2669 1452.9958 1456.6227 1466.7978 1467.6986 1468.0968 1470.7690 1473.9075 1478.8230 1481.8629 1488.7134 1497.4411 1497.9551 1594.3099 1602.0767 1681.5455 2865.7189 2911.4990 2953.1640 2955.8093 2977.8319 2985.5477 2992.7569 3017.7408 3019.1108 3021.6826 3039.9242 3042.5793 3044.8732 3073.2725 3078.1240 3081.6214 3091.8669 3094.3806 3127.6239 3134.1821 3147.9765 3161.1481 3173.3599
redmass: 4.7113 3.9865 6.9159 4.2955 4.4036 2.6545 3.3397 3.0047 2.8628 2.8297 2.7752 3.8468 3.5324 1.8213 2.6136 1.1112 4.1967 1.3743 3.8500 1.8388 1.8739 3.9137 3.3924 4.0284 2.5161 4.2960 3.1766 2.9169 3.9139 3.7971 4.4185 3.9519 4.4799 5.1619 5.8100 3.4910 3.7358 1.2347 3.9518 1.1385 1.1821 1.6749 2.4248 1.5304 5.9427 2.1128 1.3838 6.0790 1.2968 2.5103 8.4975 1.8813 6.9391 2.4124 2.0771 1.9803 1.8132 2.1682 2.9707 2.4954 1.2618 1.7368 2.4743 1.4589 1.4249 1.0651 2.4092 2.0969 1.1833 1.6903 3.4659 1.1141 1.4799 1.2070 1.3242 1.3298 1.2328 1.5486 1.3610 1.2471 1.3618 1.3345 6.1914 1.5852 1.4877 1.1140 1.0629 1.0512 1.0520 1.0679 1.0833 1.0541 1.0621 1.0569 1.0744 1.0838 2.3834 6.0439 7.5091 10.9446 1.0715 1.0693 1.0570 1.0340 1.0351 1.0368 1.0608 1.1004 1.0773 1.0671 1.0963 1.1037 1.0957 1.0990 1.0993 1.1005 1.1005 1.1089 1.0988 1.0848 1.0896 1.0935 1.0997
irintensity: 0.3852 0.1856 0.7323 0.4199 0.8089 0.3298 0.3259 5.0707 7.5854 0.3930 2.3475 0.9028 0.3467 3.0317 6.3279 0.1655 2.8575 0.3024 1.9443 0.7056 1.9115 17.3409 4.4267 5.9913 1.8241 4.3707 2.1284 13.7542 2.8317 4.9367 3.7117 0.2305 3.6470 0.6555 4.7317 0.2016 18.2188 118.6037 15.9818 4.4704 2.3242 14.4550 2.9355 0.0487 2.4937 6.0864 4.2084 50.1564 0.0112 9.4528 35.9066 0.0670 150.3606 45.9783 22.7481 17.4461 41.1544 43.3357 7.0451 559.7663 1.2442 34.0340 122.1221 8.1160 8.2532 2.6448 155.2192 9.0354 9.7808 19.1880 172.5678 0.4778 4.4433 16.7629 10.3958 2.8085 7.8652 10.2532 11.7366 20.7320 13.6290 14.1464 4.7552 13.0384 39.2873 53.3863 9.6062 15.9029 15.3552 8.2148 51.6661 2.4339 6.9611 6.6327 17.1048 1.9132 122.4933 56.1692 6.6382 190.5115 88.0867 66.5431 66.7000 52.6827 27.7264 25.6840 43.8532 20.0798 23.1665 14.5047 6.4705 51.2226 19.1404 43.5690 71.6918 42.5023 42.6322 34.4226 19.7391 0.3142 21.3395 29.4109 11.3004
temp: 298.150 k
press: 1.00000 atm
elementType: 8 8 8 8 7 6 6 6 6 6 6 6 6 6 6 6 6 6 6 6 1 1 1 1 1 1 1 1 1 1 1 1 1 1 1 1 1 1 1 1 1 1 1
symmnumber: 1
zpe: 939225.8 jmol-1
zpe.correction: 0.357732 hartree
zpe.thermalcorrener: 0.380247 hartree
zpe.thermalcorrenthalpy: 0.381191 hartree
zpe.thermalcorrgfe: 0.301692 hartree
zpe.sumelectzpe: -939.422543 hartree
zpe.sumelectthermal: -939.400028 hartree
zpe.sumelectthermalent: -939.399084 hartree
zpe.sumelectthermalfe: -939.478583 hartree
dipole: 0.8686 -2.3097 1.0290
dipole: 2.6736
quadrupole: -86.4456 -116.3224 -123.0791
quadrupole: -7.0434 0.2050 4.4614
quadrupole: 22.1701 -7.7067 -14.4634 -7.0434 0.2050 4.4614
hfenergy: -939.7802749 hartree
pointgroup: C01 [X(C15H23N1O4)]
dipole: 0.3324989 0.9285616 -0.3655457 debye
polarizability: 251.3857695|-0.3172599|199.0657387|4.2474464|1.2985269|116.8450808 unknown
InChI: InChI=1S/C15H23NO4/c1-4-16(5-2)10-11-19-15(17)12-20-14-9-7-6-8-13(14)18-3/h6-9H,4-5,10-12H2,1-3H3
charge 0 multiplicity 1
43 atoms
O  1.489171 0.390883 0.275812
O  -2.057379 -0.266835 0.1336
O  0.329554 -1.580288 0.764386
O  -4.208853 -1.782459 -0.093379
N  5.213761 -0.01347 0.168901
C  3.894321 0.648639 0.040012
C  5.570881 -0.835051 -1.016264
C  6.291993 0.864946 0.687366
C  2.79012 -0.313559 0.498641
C  6.702525 -1.842287 -0.739827
C  6.766511 2.002898 -0.257921
C  0.332176 -0.373795 0.466098
C  -0.866152 0.552708 0.277667
C  -3.276444 0.422201 0.014374
C  -4.44058 -0.404248 -0.105783
C  -3.412829 1.827422 0.006441
C  -5.7111 0.201746 -0.225722
C  -4.692846 2.4230 -0.11524
C  -5.837107 1.612808 -0.230104
C  -5.37631 -2.659152 -0.200378
H  3.870781 1.546964 0.683408
H  3.67549 0.990581 -0.998239
H  4.665539 -1.398728 -1.310573
H  5.842248 -0.201388 -1.897902
H  5.930433 1.305828 1.635971
H  7.15553 0.228752 0.954932
H  2.889367 -0.55645 1.570597
H  2.784615 -1.257439 -0.074515
H  6.849844 -2.498158 -1.617356
H  6.448596 -2.471456 0.131338
H  7.665827 -1.341105 -0.535362
H  7.543134 2.612063 0.241057
H  5.93218 2.675818 -0.52995
H  7.20231 1.603482 -1.191654
H  -0.937297 1.215543 1.166399
H  -0.693805 1.189503 -0.61266
H  -2.532004 2.470862 0.091768
H  -6.607688 -0.418687 -0.315697
H  -4.782092 3.514227 -0.119475
H  -6.829565 2.065929 -0.324223
H  -4.966685 -3.678915 -0.164182
H  -5.912269 -2.504187 -1.15759
H  -6.075504 -2.506143 0.645228
