program: Gaussian 09
title: 000037036
version: EM64L-G09RevD.01
frameworkgroup: C1[X(C12H3Cl7)]
method: RPBEPBE
basis: SDD
operation: Freq
keyword: #pfreq=noraman
keyword: PBEPBE/SDD
title: #p freq=noraman PBEPBE/SDD
converged: YES YES NO NO
title: Mulliken charges:
elementType: Cl Cl Cl Cl Cl Cl Cl C C C C C C C C C C C C H H H
charge: 0.038826 -0.006984 0.051666 0.014716 0.062140 0.009102 0.017864 0.475598 0.438942 -0.333558 -0.382500 -0.322159 -0.334078 -0.026672 -0.086539 -0.104686 -0.090343 -0.181615 -0.093808 0.284693 0.281333 0.288062
chargesum: 0.00000
title: Mulliken charges with hydrogens summed into heavy atoms:
elementType: Cl Cl Cl Cl Cl Cl Cl C C C C C C C C C C C C
charge: 0.038826 -0.006984 0.051666 0.014716 0.062140 0.009102 0.017864 0.475598 0.438942 -0.333558 -0.097807 -0.322159 -0.052744 -0.026672 -0.086539 -0.104686 -0.090343 0.106447 -0.093808
polarizability: 2.95858525e+02 -8.22538636e-01 1.83010847e+02 -9.29569330e+00 -3.45874669e+00 1.30351479e+02
1716.lowfreq: -5.3188 -0.0020 0.0005 0.0008 2.9692 5.7702 18.4621 33.5859 38.1436
frequency: 18.4051 33.5749 38.1400 75.0751 76.1806 85.6683 137.6474 154.6237 171.0311 186.1273 194.4873 203.6169 210.7056 221.9120 234.2444 257.4621 312.3698 318.1775 336.9643 338.5652 360.9369 426.0402 442.5316 470.8437 505.3414 525.9956 540.3727 554.5098 621.4034 630.2369 641.8393 669.5906 713.0475 739.5334 757.6858 789.8295 865.5773 869.4211 881.1277 896.9535 1008.5758 1045.7983 1107.7639 1128.1786 1170.6350 1240.1913 1256.9298 1313.8231 1320.5999 1344.8205 1358.8765 1401.6613 1455.0003 1528.6733 1545.9857 1571.8847 1591.3357 3166.9071 3172.9315 3182.1360
redmass: 23.0961 20.8479 20.7317 31.7049 23.5978 24.8700 27.2846 10.1866 16.2353 20.2191 26.5038 18.9718 34.4250 6.6620 19.9138 6.5846 25.6955 28.9584 20.4945 15.3044 11.2698 14.0635 3.3625 6.3778 11.8642 7.1644 6.4950 9.5490 10.7833 7.8248 9.9114 7.8713 4.1188 5.9377 9.6318 10.9525 1.4656 7.2491 1.4885 1.4609 10.3422 6.5015 2.1741 4.4478 1.8751 1.2365 4.3598 9.1903 5.0562 9.8495 8.4055 3.5919 4.0793 9.9840 9.6040 8.3094 8.4243 1.0926 1.0931 1.0932
irintensity: 0.0230 0.0363 0.0225 0.0021 0.0838 0.0345 0.1214 0.1431 0.1409 0.0444 0.0899 0.5045 0.0102 0.0065 0.2355 1.3529 0.0097 0.0552 0.3471 0.3184 1.0829 13.8034 7.5815 1.6763 25.5269 6.4414 6.1360 32.5399 23.9609 3.5609 11.1072 11.3657 1.8490 6.9935 27.8495 41.8533 7.6573 12.0118 17.8148 8.6645 45.9129 61.0513 8.9484 48.1167 38.7465 2.2760 12.3002 40.8804 65.6947 15.3540 23.6549 181.2015 66.8410 22.7907 1.6142 1.7267 10.3459 0.1910 0.3130 1.7538
temp: 298.150 k
press: 1.00000 atm
elementType: 17 17 17 17 17 17 17 6 6 6 6 6 6 6 6 6 6 6 6 1 1 1
symmnumber: 1
zpe: 289618.9 jmol-1
zpe.correction: 0.110310 hartree
zpe.thermalcorrener: 0.128683 hartree
zpe.thermalcorrenthalpy: 0.129627 hartree
zpe.thermalcorrgfe: 0.060354 hartree
zpe.sumelectzpe: -3678.155697 hartree
zpe.sumelectthermal: -3678.137324 hartree
zpe.sumelectthermalent: -3678.136380 hartree
zpe.sumelectthermalfe: -3678.205653 hartree
dipole: 0.6836 0.7163 0.4160
dipole: 1.0740
quadrupole: -165.9040 -156.7829 -156.2826
quadrupole: -1.8708 3.7662 -1.2021
quadrupole: -6.2475 2.8736 3.3739 -1.8708 3.7662 -1.2021
hfenergy: -3678.2660072 hartree
pointgroup: C01 [X(C12H3Cl7)]
dipole: 0.260441 0.3327402 -0.0011979 debye
dipolederiv: -0.2292294 0.2487478 -0.0387335 0.2817482 -0.5023823 0.0702692 -0.0448238 0.0633722 -0.0082427 -0.2975408 -0.0338478 0.2506576 -0.0413167 -0.0365339 0.0688788 0.2828157 0.0705805 -0.566409 -0.2447847 -0.2876168 0.0190328 -0.3383645 -0.4602408 0.0361912 0.0249814 0.0383948 0.0066035 -0.2153564 0.2385644 -0.0460952 0.3232325 -0.6072395 0.100646 -0.0586876 0.1027492 -0.0333699 -0.7446557 0.051246 -0.059662 0.0297808 -0.0026875 0.0036319 -0.0573153 0.0088881 0.0105262 -0.2825534 -0.0511426 0.2657579 -0.0697986 -0.0350703 0.0936423 0.3832566 0.0936784 -0.5373714 -0.8405239 -0.0168228 -0.0372122 -0.0068386 -0.0167563 0.0072913 -0.0808797 0.0035874 -0.0599415 0.3076761 0.077886 0.0530616 0.1195078 -0.0499336 0.0268594 0.068131 0.0050891 -0.0097087 0.2581943 0.0361158 0.122474 0.0401656 -0.0367896 0.0165561 0.1048767 0.0367376 -0.1498903 0.1011686 -0.4681142 0.0471116 -0.4938232 0.609849 -0.0876633 0.0510754 -0.101134 -0.0214081 -0.2084329 0.097518 -0.0243454 0.0084479 -0.1893852 0.0260469 0.011388 0.0407403 -0.0777489 0.3122679 0.0461752 -0.4451156 0.0236421 -0.0380836 -0.1380544 -0.3228401 -0.1082904 0.8538996 -0.1506969 -0.0238806 0.088286 0.0280997 -0.0627447 0.0332854 -0.0192795 0.0187936 -0.1371639 0.0966449 0.5250765 -0.0555513 0.6036791 0.5770912 -0.0418566 -0.0581905 -0.0392575 0.0011303 0.0704326 -0.4170939 0.0618781 -0.4541768 0.9131173 -0.1627491 0.034203 -0.1678969 -0.0064868 0.9927081 -0.0567938 0.075734 -0.0618775 -0.288379 0.0310883 0.078387 0.0285326 -0.0391875 0.0611762 0.0886638 -0.5446437 0.0702593 -0.0187734 -0.1526704 -0.5832365 -0.1556531 0.774102 -0.4044615 -0.015507 0.1024598 -0.0152578 -0.0372432 0.024214 0.1051063 0.01429 -0.1970444 1.1985559 -0.0080009 0.2144464 -0.0014354 -0.0511236 0.0011729 0.1556349 0.0059613 -0.0154571 0.0740478 -0.0403878 0.0047408 -0.0629298 0.0394809 0.0058596 0.0072221 0.0128001 0.1391507 0.0815597 0.0117851 -0.0384527 0.0113415 0.1342104 0.0199779 -0.0643069 0.0110979 0.0273147 0.0638037 -0.0025703 -0.0158289 0.0059144 0.1596177 0.0173824 -0.0175181 0.0169388 0.0467036 unknown
polarizability: 295.8944147|-2.253485|166.7475366|-8.4994462|-24.6636037|146.5788989 unknown
InChI: InChI=1S/C12H3Cl7/c13-6-3-8(15)7(14)1-4(6)5-2-9(16)11(18)12(19)10(5)17/h1-3H
charge 0 multiplicity 1
22 atoms
Cl -0.489455 -2.673868 0.31997
Cl 0.705433 -0.308216 2.866273
Cl -3.699046 -2.566353 0.108642
Cl -3.410717 2.960896 -0.638593
Cl -5.186668 0.247464 -0.377997
Cl 4.044803 0.613859 -2.540608
Cl 5.58334 0.16384 0.336736
C  -0.554187 0.092149 -0.00801
C  0.938155 0.091302 0.096698
C  -1.327366 -1.092294 0.08909
C  -1.224162 1.316153 -0.238952
C  1.629379 -0.08249 1.32148
C  1.715157 0.310444 -1.06802
C  -2.737436 -1.052476 -0.019935
C  -2.624799 1.360623 -0.351888
C  -3.397243 0.183266 -0.239659
C  3.122367 0.336211 -1.013068
C  3.034093 -0.062462 1.395578
C  3.783032 0.144697 0.219335
H  -0.646981 2.241558 -0.314019
H  1.214052 0.446629 -2.030874
H  3.54365 -0.198629 2.352621
