program: Gaussian 09
title: 000037045
version: EM64L-G09RevD.01
frameworkgroup: C1[X(C7H15N5O3)]
method: RPBEPBE
basis: SDD
operation: Freq
keyword: #p
keyword: freq=noraman
keyword: PBEPBE/SDD
title: #p freq=noraman PBEPBE/SDD
converged: NO YES NO NO
title: Mulliken charges:
elementType: O O O N N N N N C C C C C C C H H H H H H H H H H H H H H H
charge: -0.212056 -0.264755 -0.160721 -0.150631 0.048029 -0.621098 -0.087868 0.048162 -0.354522 -0.362947 -0.359840 -0.402040 -0.356419 -0.694062 0.388947 0.201987 0.194424 0.212806 0.230655 0.193347 0.197696 0.251911 0.264253 0.196420 0.199258 0.212099 0.210306 0.217851 0.366686 0.392123
chargesum: 0.00000
title: Mulliken charges with hydrogens summed into heavy atoms:
elementType: O O O N N N N N C C C C C C C
charge: -0.212056 -0.264755 -0.160721 -0.150631 0.048029 0.137710 -0.087868 0.048162 0.041889 0.080514 0.031203 0.114124 0.039258 -0.053806 0.388947
polarizability: 1.53796895e+02 9.44166837e+00 1.71170949e+02 1.23299561e+01 -8.45896014e+00 8.75069004e+01
1716.lowfreq: -14.8241 -2.7119 -0.0005 -0.0005 0.0006 9.9185 18.8645 29.2559 42.6898
frequency: 16.2588 28.2662 42.6341 64.2695 68.6595 75.9366 110.9103 119.1184 131.3974 152.8487 193.1410 234.0524 234.7261 264.3761 303.3592 338.9695 348.5630 373.0860 400.8139 438.8188 485.0448 582.9933 636.6369 664.5327 674.3189 699.9127 720.9630 725.5771 751.6428 781.7738 786.3555 807.1620 813.1022 868.4872 890.9876 934.6361 996.8315 1010.6642 1025.2385 1063.2601 1079.1783 1079.8763 1082.6915 1117.9308 1157.9723 1185.8515 1217.1706 1238.1352 1265.1276 1288.5908 1294.8884 1296.2761 1320.1647 1340.7495 1352.7486 1356.9412 1366.8460 1385.4751 1392.1754 1428.0261 1462.1450 1462.9975 1470.7001 1475.3165 1478.9104 1479.6430 1480.5740 1487.2066 1587.3840 2958.1584 2962.2765 2971.4392 2974.7754 2992.8511 2996.1323 3012.3483 3029.1631 3035.7486 3059.9544 3071.8457 3074.2731 3111.2413 3382.3520 3594.6507
redmass: 3.3440 1.9924 7.8068 3.1487 5.2974 7.8825 1.7336 4.9415 2.2608 7.2416 6.0149 1.1244 3.7076 10.1567 4.5367 5.4109 4.5608 3.7331 4.2606 3.2889 5.3614 5.2457 8.8433 2.3095 3.4383 2.4342 1.7961 1.0756 1.5040 1.1992 1.7728 5.8156 4.2882 1.4996 1.9018 1.8990 1.3166 3.9068 3.3028 2.9053 2.3891 6.3109 3.3457 2.5599 2.8143 2.2870 1.6730 1.2726 1.2911 1.0442 1.2612 1.1550 1.3586 1.3922 2.0139 1.6556 1.9380 6.7073 1.2163 1.2534 1.0886 1.0782 1.0796 2.9008 1.0456 1.1290 1.5270 1.0870 3.4829 1.0587 1.0588 1.0590 1.0365 1.0611 1.0958 1.1013 1.0639 1.1014 1.1028 1.1009 1.0993 1.1030 1.0521 1.0986
irintensity: 0.2513 0.1763 2.3467 0.2276 1.1101 5.7347 0.2434 0.7022 0.0446 7.4371 4.4113 0.0243 0.6767 0.0025 2.2227 1.8022 0.5459 0.4446 5.3443 2.9713 4.4108 5.6789 3.1789 61.3533 28.1789 36.8073 4.1856 9.1391 9.0611 163.6002 159.4072 12.2076 175.7069 9.4737 5.9278 112.9729 32.8086 0.1106 3.1667 0.4547 10.0801 252.2157 28.6326 14.3220 58.1160 30.6906 19.6876 4.9209 10.5472 0.2381 0.1869 3.4436 88.1134 3.2976 213.1328 11.8009 120.9398 199.5306 11.2506 43.9446 8.8904 3.5681 5.3460 218.2175 10.0984 14.1091 14.3293 22.9879 348.5108 0.2044 5.7615 90.6578 33.6422 27.0062 2.8028 0.1407 14.4145 33.8461 31.3597 91.4099 51.4315 2.7622 100.0235 128.2131
temp: 298.150 k
press: 1.00000 atm
elementType: 8 8 8 7 7 7 7 7 6 6 6 6 6 6 6 1 1 1 1 1 1 1 1 1 1 1 1 1 1 1
symmnumber: 1
zpe: 626360.1 jmol-1
zpe.correction: 0.238568 hartree
zpe.thermalcorrener: 0.255439 hartree
zpe.thermalcorrenthalpy: 0.256383 hartree
zpe.thermalcorrgfe: 0.190782 hartree
zpe.sumelectzpe: -773.823265 hartree
zpe.sumelectthermal: -773.806395 hartree
zpe.sumelectthermalent: -773.805451 hartree
zpe.sumelectthermalfe: -773.871052 hartree
dipole: 1.3310 2.9984 -0.4275
dipole: 3.3082
quadrupole: -87.5808 -110.9292 -87.9211
quadrupole: -14.1961 3.2309 0.9026
quadrupole: 7.8962 -15.4522 7.5559 -14.1961 3.2309 0.9026
hfenergy: -774.0618335 hartree
pointgroup: C01 [X(C7H15N5O3)]
dipole: -0.5488388 -1.1566949 -0.2343083 debye
polarizability: 153.7433776|10.7456749|169.358203|-12.5954207|13.7998617|89.3731637 unknown
InChI: InChI=1S/C7H15N5O3/c1-2-3-4-5-6-11(10-13)7(8)9-12(14)15/h2-6,8H2,1H3
charge 0 multiplicity 1
30 atoms
O  0.458838 -3.439558 -0.207926
O  3.940452 1.718108 -0.486428
O  2.462029 3.069194 0.605178
N  1.110581 -1.296547 0.102357
N  1.382455 -2.590774 -0.408706
N  3.238772 -0.776049 -0.806428
N  1.835865 0.889309 0.328209
N  2.797796 1.933408 0.134683
C  -2.554368 -0.127093 0.599358
C  -1.241365 -0.422388 -0.16008
C  -3.665147 0.417575 -0.32682
C  -0.156296 -0.964079 0.799388
C  -4.98497 0.71552 0.420903
C  -6.090819 1.258333 -0.509687
C  2.136428 -0.344884 -0.147034
H  -2.356719 0.609088 1.405404
H  -2.913346 -1.052587 1.095605
H  -1.432453 -1.161094 -0.96234
H  -0.868475 0.504591 -0.634663
H  -3.861307 -0.315013 -1.137047
H  -3.309061 1.344268 -0.822322
H  -0.499152 -1.901357 1.27347
H  0.077204 -0.215249 1.571683
H  -5.339748 -0.210422 0.917694
H  -4.788111 1.447648 1.23023
H  -5.773451 2.200342 -0.995137
H  -6.327295 0.531862 -1.309785
H  -7.02341 1.463205 0.047078
H  3.294534 -1.753392 -1.097122
H  3.963836 -0.067067 -0.980016
