program: Gaussian 09
title: 000037046
version: EM64L-G09RevD.01
frameworkgroup: C1[X(C9H11N5O3)]
method: RPBEPBE
basis: SDD
operation: Freq
keyword: #p
keyword: freq=noraman
keyword: PBEPBE/SDD
title: #p freq=noraman PBEPBE/SDD
converged: YES YES NO NO
title: Mulliken charges:
elementType: O O O N N N N N C C C C C C C C C H H H H H H H H H H H
charge: -0.210112 -0.263112 -0.160772 -0.146728 0.050168 -0.620301 -0.090237 0.048320 -0.561255 -0.409300 0.495529 -0.403317 -0.395178 -0.224573 -0.225770 0.397251 -0.238543 0.226332 0.244234 0.270146 0.282760 0.237977 0.250181 0.227073 0.228889 0.230660 0.367032 0.392647
chargesum: 0.00000
title: Mulliken charges with hydrogens summed into heavy atoms:
elementType: O O O N N N N N C C C C C C C C C
charge: -0.210112 -0.263112 -0.160772 -0.146728 0.050168 0.139377 -0.090237 0.048320 -0.090690 0.143607 0.495529 -0.165340 -0.144997 0.002500 0.003119 0.397251 -0.007883
polarizability: 1.95550303e+02 -5.75504286e+00 1.96887998e+02 1.42640267e+01 7.58451478e+00 6.98695114e+01
1716.lowfreq: -5.5382 -1.1339 0.0009 0.0011 0.0011 8.3307 19.3806 23.8981 42.2455
frequency: 18.9958 23.8662 42.2062 57.6729 73.6087 75.8222 106.6910 152.4685 193.5118 248.5935 268.4389 299.8199 333.2383 339.4054 378.4787 396.4331 403.1891 428.7290 506.9723 541.0213 604.9455 617.2213 636.1152 663.9278 674.7379 699.5300 705.7029 728.9786 758.0777 784.6677 786.7475 793.1982 812.7936 842.6207 857.1157 913.8308 925.9897 980.2050 989.8987 997.5272 1015.7062 1026.8719 1031.2294 1079.9872 1081.4705 1106.5011 1166.9639 1173.6849 1188.8019 1217.7654 1234.1952 1299.6231 1317.1121 1331.7144 1351.1681 1366.7592 1382.4813 1386.9664 1433.7571 1442.8568 1474.7045 1480.4118 1480.8229 1485.0019 1587.6533 1593.9625 1614.0245 3010.1358 3040.7831 3071.2487 3116.9019 3118.6967 3121.6300 3133.7410 3146.5514 3164.2214 3378.8223 3593.9553
redmass: 5.7818 4.4457 8.7334 3.6601 5.7213 8.7542 7.1339 8.2663 7.4114 4.7980 9.6567 3.5219 2.9498 5.2319 3.6068 4.9465 2.8442 7.8649 3.2697 6.0329 5.2978 6.3812 9.0263 2.2504 3.5700 2.4871 1.8720 2.6641 1.8190 1.5124 1.7631 3.8260 4.1151 3.8220 1.2487 2.3826 1.5695 1.3866 6.2755 1.3439 4.2076 2.2163 1.9933 2.9922 5.0648 1.7662 2.9374 1.0591 1.1191 2.5763 1.6274 1.3438 1.3713 1.2734 2.0187 1.7681 8.0374 7.0012 1.2945 2.1640 2.3305 1.6053 1.3611 1.9246 3.5281 6.0043 6.1118 1.0590 1.0609 1.1029 1.0877 1.0878 1.1038 1.0907 1.0958 1.1015 1.0524 1.0983
irintensity: 0.4184 0.1602 2.6929 0.1499 0.1193 6.4579 0.4041 7.3427 5.4573 2.0695 0.2514 2.6138 0.4717 1.5726 1.6921 7.2135 0.1061 2.6084 26.6344 1.2772 5.9280 0.0504 3.2763 61.1615 28.8890 35.5337 47.8448 4.2731 51.0245 179.5353 184.6642 7.4774 105.1816 45.5011 0.2069 101.5237 7.3935 0.1395 0.2447 0.0601 5.5360 8.1060 34.8610 182.4519 129.7387 6.0129 72.3855 0.4997 0.2016 1.5929 35.9351 3.1691 64.5871 16.7722 229.3005 91.7467 33.4847 162.9617 59.1297 10.8071 257.0489 4.1818 14.7285 19.6957 349.6127 1.2739 3.7327 15.3118 10.5484 6.6642 6.2156 4.9811 0.6835 8.7493 33.6243 23.8035 107.7479 125.1881
temp: 298.150 k
press: 1.00000 atm
elementType: 8 8 8 7 7 7 7 7 6 6 6 6 6 6 6 6 6 1 1 1 1 1 1 1 1 1 1 1
symmnumber: 1
zpe: 543773.8 jmol-1
zpe.correction: 0.207113 hartree
zpe.thermalcorrener: 0.222834 hartree
zpe.thermalcorrenthalpy: 0.223778 hartree
zpe.thermalcorrgfe: 0.160678 hartree
zpe.sumelectzpe: -847.574566 hartree
zpe.sumelectthermal: -847.558845 hartree
zpe.sumelectthermalent: -847.557900 hartree
zpe.sumelectthermalfe: -847.621001 hartree
dipole: -1.0423 3.0167 -0.0198
dipole: 3.1917
quadrupole: -91.8002 -112.7330 -99.3444
quadrupole: 15.8524 2.1944 2.0499
quadrupole: 9.4923 -11.4405 1.9482 15.8524 2.1944 2.0499
hfenergy: -847.7816785 hartree
pointgroup: C01 [X(C9H11N5O3)]
dipole: -0.4145523 -1.1853195 -0.0025808 debye
polarizability: 194.8009496|6.2548829|196.5395479|-17.2715262|9.7043079|70.9673153 unknown
InChI: InChI=1S/C9H11N5O3/c10-9(11-14(16)17)13(12-15)7-6-8-4-2-1-3-5-8/h1-5H,6-7,10H2
charge 0 multiplicity 1
28 atoms
O  0.613205 -3.471403 0.147436
O  4.393971 1.462774 -0.3042
O  2.783092 3.033294 0.074378
N  1.321533 -1.322258 0.190046
N  1.613048 -2.700698 0.011101
N  3.634199 -1.035678 -0.260719
N  2.109732 0.850321 0.121517
N  3.1520 1.818631 -0.044374
C  -0.8419 -0.439004 -0.774933
C  -0.039816 -0.827808 0.501075
C  -2.222857 0.065219 -0.383183
C  -3.329827 -0.819407 -0.322736
C  -2.41362 1.425036 -0.024694
C  -4.601594 -0.35633 0.084106
C  -3.683794 1.890738 0.382299
C  2.436372 -0.460741 0.003435
C  -4.781865 1.000736 0.438845
H  -0.920435 -1.321156 -1.436069
H  -0.278624 0.347749 -1.308047
H  -0.554096 -1.644256 1.03748
H  0.062662 0.048142 1.158493
H  -3.196031 -1.872118 -0.60234
H  -1.56566 2.119916 -0.07249
H  -5.449432 -1.04965 0.120918
H  -3.817985 2.944479 0.651198
H  -5.767816 1.361665 0.752288
H  3.695835 -2.053176 -0.322729
H  4.422904 -0.388017 -0.393599
