program: Gaussian 09
title: 000037020
version: EM64L-G09RevD.01
frameworkgroup: C1[X(C11H10ClNO3)]
method: RPBEPBE
basis: SDD
operation: Freq
keyword: #p
keyword: freq=noraman
keyword: PBEPBE/SDD
title: #p freq=noraman PBEPBE/SDD
converged: YES YES NO NO
title: Mulliken charges:
elementType: Cl O O O N C C C C C C C C C C C H H H H H H H H H H
charge: -0.053956 -0.302182 -0.174128 -0.263116 -0.601803 0.082180 -0.496985 -0.539097 0.396478 0.178918 0.184109 -0.352282 -0.388205 -0.222076 -0.195928 -0.110726 0.282238 0.250692 0.270115 0.271589 0.278845 0.282628 0.257929 0.257933 0.340282 0.366547
chargesum: 0.00000
title: Mulliken charges with hydrogens summed into heavy atoms:
elementType: Cl O O O N C C C C C C C C C C C
charge: -0.053956 -0.302182 -0.174128 -0.263116 0.105025 0.082180 0.035945 0.002607 0.396478 0.178918 0.184109 -0.073438 -0.105576 0.035853 0.062005 -0.110726
polarizability: 1.92388884e+02 4.07436169e+00 1.26225610e+02 2.38380570e+00 1.62712664e+01 9.76168765e+01
1716.lowfreq: -6.9388 -2.8469 -0.0024 -0.0013 0.0021 5.0711 33.2916 48.5326 67.7551
frequency: 32.9999 48.5215 67.7524 78.6976 111.0312 120.4154 158.4140 225.0814 242.3815 271.4059 326.4412 347.6598 373.2533 407.2339 410.1644 450.0870 492.7501 507.6570 537.4880 573.9290 579.8043 621.6948 648.8903 653.7940 674.4680 716.4192 722.0981 739.4703 790.6982 836.1559 840.2936 840.8284 890.9975 957.4805 965.4777 980.5589 998.7913 1004.1439 1036.5952 1066.6860 1073.8471 1075.1308 1095.2842 1116.0739 1170.9983 1187.7908 1218.1950 1227.5792 1281.8128 1294.9122 1306.1292 1343.9413 1367.4270 1392.6170 1442.3929 1470.1726 1474.6306 1574.5608 1583.4986 1599.2616 1643.8498 1721.9187 3014.5165 3040.3049 3099.1898 3117.2951 3145.9283 3160.9308 3172.5909 3180.6345 3505.2660 3661.7865
redmass: 4.1551 7.0791 6.3086 7.9934 3.5389 5.7862 6.9312 4.0824 8.9264 4.4409 5.9725 4.4129 5.8752 3.1492 6.5579 5.9929 4.2094 2.6702 3.0785 3.2057 1.6595 7.0867 1.3322 2.8815 3.2502 4.4303 4.7733 4.0556 3.1609 1.6299 1.3321 2.7905 2.6273 4.1688 1.4717 1.3514 2.4688 3.5584 3.3191 2.1114 2.5723 2.1608 3.8185 1.5054 1.5507 1.1264 1.3767 3.6296 1.4011 1.2558 1.4726 3.4648 6.7570 3.4125 1.0782 1.0928 2.3757 1.4101 7.2630 5.9774 4.5336 12.1801 1.0659 1.0621 1.0971 1.1044 1.0901 1.0888 1.0958 1.0968 1.0448 1.1047
irintensity: 0.0510 1.4202 2.4748 11.7672 3.8549 5.9264 0.8311 0.6376 2.4328 14.3936 1.4980 0.8099 0.6213 1.0146 6.5433 9.4943 13.8415 0.6705 25.9582 14.9645 76.4775 3.1101 144.1487 52.4893 4.5433 3.9687 31.3375 5.7182 17.6761 54.9679 19.1144 116.4305 11.0919 56.8608 9.5591 0.1484 45.7263 16.5022 149.2594 2.1004 32.3103 28.7150 142.0229 13.3146 16.0469 3.0239 5.1718 16.5102 6.3929 1.2068 10.5985 100.3384 2.4533 10.7226 17.3764 19.8054 92.9922 83.2336 4.4561 10.4680 236.0192 384.1498 6.2805 13.1116 4.1881 3.5031 0.1408 0.8150 2.3673 1.5792 51.0067 54.7071
temp: 298.150 k
press: 1.00000 atm
elementType: 17 8 8 8 7 6 6 6 6 6 6 6 6 6 6 6 1 1 1 1 1 1 1 1 1 1
symmnumber: 1
zpe: 503084.6 jmol-1
zpe.correction: 0.191615 hartree
zpe.thermalcorrener: 0.205903 hartree
zpe.thermalcorrenthalpy: 0.206847 hartree
zpe.thermalcorrgfe: 0.148960 hartree
zpe.sumelectzpe: -1164.528467 hartree
zpe.sumelectthermal: -1164.514179 hartree
zpe.sumelectthermalent: -1164.513235 hartree
zpe.sumelectthermalfe: -1164.571122 hartree
dipole: -1.2318 0.8132 0.3135
dipole: 1.5089
quadrupole: -110.4029 -108.8080 -89.8550
quadrupole: -7.3380 -1.2968 -5.2844
quadrupole: -7.3809 -5.7860 13.1670 -7.3380 -1.2968 -5.2844
hfenergy: -1164.7200818 hartree
pointgroup: C01 [X(C11H10Cl1N1O3)]
dipole: 0.4673614 0.3040654 -0.2038242 debye
dipolederiv: -0.9021505 -0.157936 -0.0167065 -0.1675412 -0.1289242 0.0230256 -0.0153285 0.0236327 -0.1002466 -1.4784365 0.5439599 -0.2048617 0.4902184 -0.6446433 0.1116224 0.1102668 -0.0500246 -0.4594254 -0.8951418 0.3238574 -0.2145985 0.3957128 -0.5186912 0.190738 -0.4363306 0.2773514 -0.6979799 -0.4021074 -0.0746272 -0.0410574 -0.022955 -0.7710363 0.3007088 -0.1024512 0.0510733 -0.8183584 -0.6696712 -0.0406507 -0.1192318 -0.102732 -0.4672611 -0.3397847 -0.1778726 -0.2158327 -0.952949 0.508426 -0.2046225 0.0477349 -0.2278668 0.1984949 -0.0458816 0.4409446 -0.14901 0.3097509 -0.0712348 -0.0009729 0.0723632 0.020799 0.0574358 -0.004045 -0.0918495 0.0429413 -0.0270813 -0.0830312 0.0415416 0.0569362 0.087948 0.0845338 0.0948391 0.1486149 0.0643993 -0.3207031 0.2951474 0.1489923 -0.0079145 0.0121396 -0.1488514 -0.0123947 -0.0370373 0.0156802 -0.0906207 1.8257626 -0.8357142 0.2876448 -0.8277995 0.63977 -0.3310013 0.0127859 -0.1645539 0.964009 0.1761389 0.181736 0.2446568 0.2981109 1.0096798 0.0154694 0.3057853 0.1155093 1.3060567 -0.0639932 0.0408824 -0.0147458 -0.0332423 -0.0407439 -0.0779212 0.0388072 -0.0683043 -0.0552196 -0.0638273 -0.0399191 0.0475744 0.0500203 -0.0514551 -0.0597143 -0.0245016 -0.0947734 -0.0388257 -0.2974471 -0.0984655 0.0641858 -0.0969225 -0.0837041 -0.0557054 0.0817905 -0.0321772 -0.0348742 -0.3434123 0.0019896 -0.0539517 0.002062 -0.0397202 -0.0681234 -0.056537 -0.0575185 -0.0364926 1.2762445 0.2487625 0.0359117 0.258387 0.0678264 -0.0835378 0.0344375 -0.0863188 0.0366726 0.0756914 0.0085003 -0.0297226 0.0028493 0.0775282 0.106884 -0.022127 0.0587 0.0270545 0.0268907 -0.0500942 -0.0379266 -0.0767468 -0.0567117 -0.0668722 -0.0582645 -0.0396712 0.072074 0.027653 -0.0575783 -0.0361657 -0.1057486 0.0144901 0.0128056 -0.0341698 -0.0024312 0.0856426 0.0325381 0.0612936 0.0133943 0.0919646 0.0055178 -0.0672997 0.0172886 -0.0379381 0.0789477 0.1148986 -0.0281913 0.0526955 -0.0295126 0.0818911 0.0702929 0.0308608 0.0574674 0.0879616 0.097535 0.0307034 -0.0574823 0.0480053 0.0952646 0.0529505 -0.0633026 0.0593306 0.0774769 0.027641 0.0308992 -0.0625453 0.0292931 0.1049178 0.0701587 -0.0630351 0.0690149 0.0728222 0.0556243 -0.0508777 0.0299609 -0.0510023 0.0725309 0.0869584 0.0304587 0.0881755 0.0722374 0.3746603 -0.0096477 -0.0294417 0.0003531 0.1803792 0.0390249 -0.0448385 0.0135629 0.1983456 0.3556016 -0.013821 -0.0267062 -0.0457937 0.2614822 0.0368031 -0.0243952 0.061715 0.2437248 unknown
polarizability: 190.9022135|7.5849063|111.4389453|11.1440349|-20.6494715|113.8902115 unknown
InChI: InChI=1S/C11H10ClNO3/c12-8-3-1-7(2-4-8)11(10(13)15)6-5-9(14)16-11/h1-4H,5-6,13H2
charge 0 multiplicity 1
26 atoms
Cl -5.265507 -0.783812 -0.328542
O  1.432812 -0.278487 0.841598
O  3.447376 -1.358449 1.25851
O  0.937797 2.715315 -1.185519
N  1.372921 2.371716 1.082288
C  0.778895 0.415978 -0.314255
C  1.4998 -0.161683 -1.571257
C  2.904332 -0.524111 -1.048603
C  -0.72343 0.1350 -0.281618
C  2.704062 -0.802773 0.44163
C  1.047479 1.949822 -0.182508
C  -1.577007 0.798994 -1.199862
C  -1.269138 -0.806554 0.623553
C  -2.960926 0.522774 -1.218276
C  -2.653372 -1.09054 0.61344
C  -3.477772 -0.421407 -0.309802
H  1.504603 0.584016 -2.380565
H  0.964944 -1.063204 -1.913564
H  3.615167 0.318553 -1.14501
H  3.360375 -1.39921 -1.536815
H  -1.162956 1.543044 -1.888853
H  -0.613341 -1.313369 1.33636
H  -3.621884 1.034866 -1.923258
H  -3.078527 -1.81736 1.311485
H  1.517421 3.366576 1.251526
H  1.466475 1.695509 1.841516
