program: Gaussian 09
title: 000037105
version: EM64L-G09RevD.01
frameworkgroup: C1[X(C14H14N4O4S)]
method: RPBEPBE
basis: SDD
operation: Freq
keyword: #p
keyword: freq=noraman
keyword: PBEPBE/SDD
title: #p freq=noraman PBEPBE/SDD
converged: YES YES NO NO
title: Mulliken charges:
elementType: S O O O O N N N N C C C C C C C C C C C C C C H H H H H H H H H H H H H H
charge: 0.863438 -0.533514 -0.549544 -0.252223 -0.244077 -0.282071 -0.347320 -0.454204 0.003520 -0.149314 -0.204942 -0.214346 0.503213 -0.336121 -0.428536 0.185359 0.331807 0.230066 -0.300322 -0.304730 -0.778297 -0.317713 -0.334617 0.301027 0.295737 0.322008 0.233110 0.303396 0.361468 0.308697 0.263956 0.282086 0.263262 0.264245 0.215314 0.249720 0.250463
chargesum: 0.00000
title: Mulliken charges with hydrogens summed into heavy atoms:
elementType: S O O O O N N N N C C C C C C C C C C C C C C
charge: 0.863438 -0.533514 -0.549544 -0.252223 -0.244077 0.021325 0.014148 -0.145507 0.003520 -0.149314 0.096085 0.081391 0.503213 -0.014113 -0.195426 0.185359 0.331807 0.230066 -0.036366 -0.022644 -0.035476 -0.067993 -0.084155
polarizability: 3.70577258e+02 1.46780058e+01 2.48842458e+02 -1.07397615e+00 -1.98578725e+01 1.44524740e+02
1716.lowfreq: -9.2237 -3.1380 -0.0020 0.0007 0.0009 6.5789 18.3817 27.0003 33.4925
frequency: 18.2459 26.8237 33.4898 48.1686 48.2380 57.4923 70.8312 77.6163 89.2106 103.0822 126.5033 137.6767 151.7668 178.9226 185.3832 210.2652 262.8338 285.3933 299.1825 318.2272 326.8044 348.3478 362.8328 370.0199 382.2589 399.4221 413.8262 443.4982 473.1516 524.6829 527.8728 547.3124 596.8603 618.4782 650.6002 655.9026 667.0576 670.4865 682.6761 694.8470 721.8151 749.8744 773.4682 822.4347 829.2753 834.7171 841.2505 862.2507 888.8253 899.0321 930.9244 954.9218 957.1055 966.5984 975.8737 979.9636 981.9665 995.1876 997.9637 1023.0834 1040.8092 1048.0081 1065.1965 1089.9028 1124.6615 1144.6115 1186.5188 1216.2245 1219.4794 1252.6940 1262.6656 1296.5980 1304.1304 1328.8212 1338.7110 1368.1836 1391.0353 1399.5602 1406.1099 1448.7486 1459.7654 1469.3421 1475.3120 1476.9384 1499.4506 1545.3268 1576.7842 1591.0453 1596.1641 1608.8371 1631.5655 2997.6157 3096.2281 3104.3049 3123.6294 3138.2483 3138.3479 3142.8349 3158.6499 3162.5339 3172.0538 3195.0460 3197.4454 3533.8745 3540.9545
redmass: 7.1727 5.3363 4.9410 2.6137 6.6147 1.7092 3.5817 4.0910 8.6394 7.0540 6.4947 10.7556 5.4626 6.9320 7.3754 7.1327 7.9371 6.4696 6.8326 6.7056 6.4441 5.3866 2.5943 5.2843 6.2405 6.0347 3.0611 6.3017 6.0097 2.9958 4.8419 4.6744 3.1243 6.9797 1.1977 6.8409 5.5769 5.7234 2.2126 2.1334 3.2755 3.1331 12.7103 4.8048 2.5450 1.4013 1.9327 1.4756 1.3193 6.4950 6.0463 4.1671 1.3841 1.3353 1.5221 1.5227 4.9826 1.6401 1.3339 4.9814 1.6402 2.3599 2.1000 1.6657 1.3365 3.2585 1.1443 3.4145 1.2806 3.5704 1.8113 8.1454 1.4352 1.4157 1.5867 4.0984 1.2267 1.8582 4.5991 1.0462 1.9291 1.1515 1.9906 1.4379 2.2824 6.6413 5.5260 6.6340 5.6175 5.3670 4.9539 1.0364 1.0992 1.0994 1.0902 1.0897 1.0907 1.0898 1.0978 1.0950 1.0976 1.0722 1.0947 1.0766 1.0792
irintensity: 0.6443 4.2857 0.4964 1.2140 4.6455 0.9247 1.9097 4.1796 1.5972 0.3066 4.0501 13.0839 6.0633 10.3712 7.2956 12.8030 11.4514 2.8091 3.7122 2.9512 5.6889 52.2837 2.4527 1.8606 1.0063 10.6446 0.6959 37.7971 5.6395 43.6382 14.5744 58.1340 1.4474 3.8911 55.9424 3.5491 14.1478 1.5834 1.4928 69.2872 1.0114 11.4496 72.4510 1.4347 17.6904 40.5265 29.1333 54.5440 1.0752 52.3999 5.1426 4.4376 85.1674 2.5716 0.2328 1.6988 5.9895 17.9214 8.8393 51.1702 15.5535 42.9732 5.7354 1.1923 28.0914 217.3074 39.8550 81.3509 10.8071 161.9989 52.3774 9.2599 66.2845 2.2376 332.0474 245.2049 49.7448 23.6958 13.9496 16.4362 3.8016 14.4276 45.1052 72.0788 495.8185 20.1376 16.1205 88.2744 45.4292 59.5643 99.7955 11.1655 12.0132 10.7401 15.7105 11.2647 7.9661 13.1859 9.3979 13.4400 8.3385 30.3250 10.0965 18.1300 62.3577
temp: 298.150 k
press: 1.00000 atm
elementType: 16 8 8 8 8 7 7 7 7 6 6 6 6 6 6 6 6 6 6 6 6 6 6 1 1 1 1 1 1 1 1 1 1 1 1 1 1
symmnumber: 1
zpe: 703630.2 jmol-1
zpe.correction: 0.267999 hartree
zpe.thermalcorrener: 0.290535 hartree
zpe.thermalcorrenthalpy: 0.291479 hartree
zpe.thermalcorrgfe: 0.212772 hartree
zpe.sumelectzpe: -1458.024938 hartree
zpe.sumelectthermal: -1458.002402 hartree
zpe.sumelectthermalent: -1458.001458 hartree
zpe.sumelectthermalfe: -1458.080165 hartree
dipole: 5.1629 0.1237 1.5424
dipole: 5.3898
quadrupole: -94.9970 -160.7904 -146.0800
quadrupole: 5.6701 -12.0073 -1.8997
quadrupole: 38.9588 -26.8346 -12.1242 5.6701 -12.0073 -1.8997
hfenergy: -1458.2929366 hartree
pointgroup: C01 [X(C14H14N4O4S1)]
dipole: -1.9124777 0.0839534 0.9120803 debye
polarizability: 368.267941|7.0076834|242.476859|-29.7073538|28.3692698|153.1996554 unknown
InChI: InChI=1S/C8H8NO3S.C6H6N3O/c1-6(10)9-7-2-4-8(5-3-7)13(11)12;7-9-6(10)5-1-3-8-4-2-5/h2-5,9H,1H3;1-4,7,9H
charge 0 multiplicity 1
37 atoms
S  0.20018 -2.095905 -0.321032
O  -0.275773 -3.612621 -0.701504
O  1.162976 -1.249641 -1.366661
O  1.934071 0.743353 1.286882
O  -4.250585 3.203964 1.087876
N  1.663081 -2.037988 1.437152
N  2.705731 -1.395183 0.835236
N  -4.953412 1.007027 0.643936
N  5.912554 1.548419 -1.893621
C  -1.369543 -1.096464 -0.007418
C  -1.273748 0.274668 0.28288
C  -2.593224 -1.785239 -0.07711
C  -3.718024 0.340447 0.432984
C  -2.459921 1.004362 0.504707
C  -3.772942 -1.052445 0.141474
C  2.761489 0.018125 0.661293
C  3.853965 0.5230 -0.218873
C  -5.178978 2.357878 0.947567
C  4.527879 1.722859 0.11848
C  4.200755 -0.141058 -1.423834
C  -6.649122 2.740179 1.090157
C  5.547536 2.187329 -0.739935
C  5.230899 0.409506 -2.219149
H  -0.302352 0.779479 0.340736
H  -2.611455 -2.855053 -0.308074
H  -2.428241 2.070793 0.732404
H  -4.741466 -1.564532 0.084593
H  1.150683 -1.2927 1.979416
H  3.363915 -2.000107 0.337512
H  -5.787117 0.421243 0.559475
H  4.257355 2.271188 1.025695
H  3.637296 -1.014322 -1.769698
H  -6.903296 3.479512 0.310558
H  -6.795115 3.234949 2.065137
H  -7.34857 1.889961 1.012893
H  6.100117 3.104354 -0.509024
H  5.521402 -0.065337 -3.162409
