program: Gaussian 09
title: 000037023
version: EM64L-G09RevD.01
frameworkgroup: C1[X(C17H14ClNO3)]
method: RPBEPBE
basis: SDD
operation: Freq
keyword: #p
keyword: freq=noraman
keyword: PBEPBE/SDD
title: #p freq=noraman PBEPBE/SDD
converged: YES YES NO NO
title: Mulliken charges:
elementType: Cl O O O N C C C C C C C C C C C C C C C C C H H H H H H H H H H H H H H
charge: -0.052982 -0.307107 -0.256890 -0.169353 -0.438872 0.033280 -0.495537 -0.535983 0.402004 0.139069 0.178633 -0.354304 -0.386997 -0.220606 -0.197046 0.493056 -0.112864 -0.450507 -0.346964 -0.195079 -0.215581 -0.250550 0.252231 0.283713 0.271999 0.271673 0.278434 0.282095 0.360462 0.257948 0.257977 0.231882 0.301871 0.230281 0.228974 0.231642
chargesum: 0.00000
title: Mulliken charges with hydrogens summed into heavy atoms:
elementType: Cl O O O N C C C C C C C C C C C C C C C C C
charge: -0.052982 -0.307107 -0.256890 -0.169353 -0.078410 0.033280 0.040407 0.007689 0.402004 0.139069 0.178633 -0.075870 -0.104902 0.037342 0.060931 0.493056 -0.112864 -0.218625 -0.045094 0.035202 0.013393 -0.018908
polarizability: 2.56956491e+02 6.93389731e-01 1.87922791e+02 5.86373334e+00 -1.43130214e+01 1.83065482e+02
1716.lowfreq: -8.0897 -0.0011 0.0006 0.0006 2.3658 8.8366 18.8916 32.3166 40.0586
frequency: 18.8419 32.2690 40.0359 50.4773 76.1559 84.3368 97.3296 117.9820 139.8228 154.0542 218.7679 227.1484 263.2392 268.5445 292.7245 331.2583 339.8259 367.6563 407.3120 407.6204 417.7361 443.1276 490.2813 505.5949 513.4761 536.3770 563.4579 613.9712 621.4724 631.7878 649.3173 691.2004 696.3665 713.8603 730.3901 757.5526 779.7557 784.8304 797.5578 833.9410 838.3070 840.9523 848.8921 849.4259 918.0892 923.5245 956.8539 966.1576 977.3630 981.6588 985.7272 998.1361 1000.7000 1003.5377 1026.5447 1040.8644 1069.2183 1073.7915 1089.9784 1094.1906 1116.4767 1154.2412 1174.1279 1188.2918 1189.8590 1197.2045 1222.5850 1226.2193 1261.9422 1282.8238 1295.6219 1308.3685 1325.1921 1366.3877 1386.9903 1392.2630 1434.6544 1442.6971 1468.8396 1474.0946 1486.1043 1524.4189 1582.8467 1598.5245 1602.1731 1611.3499 1616.7872 1723.9202 3013.6364 3039.4633 3099.5149 3116.1112 3118.1588 3134.8871 3146.4384 3147.8062 3161.4804 3167.5017 3172.7096 3180.9967 3194.5699 3466.3136
redmass: 8.2192 3.8839 4.0227 8.1501 7.5479 6.4420 6.2521 3.4271 7.1033 5.7228 4.8956 5.5817 7.8203 5.9651 3.5534 5.9359 7.3858 5.6931 2.9239 2.9754 8.7997 7.4786 5.1122 2.6639 3.0837 3.4930 5.4403 6.4685 7.1258 4.4732 7.2757 5.6150 1.9177 5.7266 4.0815 1.3836 4.1337 1.5757 3.0119 3.2722 1.9180 1.2450 1.4981 2.1575 3.8340 1.4531 4.3885 1.4018 1.3587 1.3500 6.1427 2.3762 1.3151 3.7004 2.2157 3.8081 2.1840 2.6628 1.8375 2.8801 1.4971 1.7957 1.0524 1.1268 1.1153 2.1567 1.6858 3.4445 2.0596 1.4051 1.2566 1.4003 1.4078 6.6059 7.6553 3.4218 2.3392 1.0802 1.0925 2.3589 2.3372 2.0747 7.8168 6.0394 5.3635 5.7736 6.7883 12.2707 1.0659 1.0621 1.0971 1.1043 1.0886 1.0871 1.0900 1.0936 1.0887 1.0999 1.0959 1.0968 1.0953 1.0762
irintensity: 0.4056 0.4837 0.0424 0.5051 4.3037 2.1101 4.0407 5.1775 3.4389 2.3436 2.1441 1.9473 6.6755 0.8707 7.4676 0.4378 6.8401 1.1914 0.0190 0.1700 2.3992 24.9580 10.0175 0.8978 13.9650 32.4211 5.8835 0.2307 0.9947 13.6099 4.5745 16.4744 36.6957 4.6135 10.9150 0.0342 56.9169 86.1139 39.5448 96.8456 89.2568 0.1088 23.8607 8.0889 7.6685 17.5397 49.0477 6.4600 0.0320 0.1266 0.1217 42.4723 4.2662 24.9827 13.5106 173.8146 15.4161 28.1250 53.4125 106.2773 10.5005 24.7006 0.3063 4.8787 1.9312 5.7731 4.9995 13.6868 13.1247 4.2056 1.6725 4.9106 26.5489 1.9137 26.9054 10.8886 79.9440 19.5780 28.2811 116.4821 44.5192 375.8915 2.1138 13.3576 54.4933 147.7519 35.0406 348.8816 5.6076 16.7739 4.9977 4.5641 9.7388 0.9137 0.1243 25.8489 0.8310 24.5806 2.2929 1.7610 5.6527 51.0424
temp: 298.150 k
press: 1.00000 atm
elementType: 17 8 8 8 7 6 6 6 6 6 6 6 6 6 6 6 6 6 6 6 6 6 1 1 1 1 1 1 1 1 1 1 1 1 1 1
symmnumber: 1
zpe: 711813.7 jmol-1
zpe.correction: 0.271116 hartree
zpe.thermalcorrener: 0.289970 hartree
zpe.thermalcorrenthalpy: 0.290914 hartree
zpe.thermalcorrgfe: 0.221424 hartree
zpe.sumelectzpe: -1395.172323 hartree
zpe.sumelectthermal: -1395.153468 hartree
zpe.sumelectthermalent: -1395.152524 hartree
zpe.sumelectthermalfe: -1395.222014 hartree
dipole: -1.0865 0.3825 1.0286
dipole: 1.5443
quadrupole: -134.9600 -139.1370 -131.2689
quadrupole: 12.8610 3.3058 9.3357
quadrupole: 0.1619 -4.0150 3.8531 12.8610 3.3058 9.3357
hfenergy: -1395.4434381 hartree
pointgroup: C01[X(C17H14Cl1N1O3)]
dipole: 0.3798932 0.325865 -0.3444441 debye
polarizability: 252.889237|15.1917385|185.7321135|5.8144301|16.0016525|189.3234135 unknown
InChI: InChI=1S/C17H14ClNO3/c18-13-8-6-12(7-9-13)17(11-10-15(20)22-17)16(21)19-14-4-2-1-3-5-14/h1-9,19H,10-11H2
charge 0 multiplicity 1
36 atoms
Cl -4.980499 -3.733318 -0.315393
O  -0.804205 1.453112 1.160113
O  0.671347 0.348032 -1.989467
O  -0.527635 3.521693 2.183939
N  1.342499 0.17698 0.268725
C  -0.952319 0.930636 -0.237375
C  -1.45068 2.1581 -1.05865
C  -0.860037 3.365454 -0.302977
C  -1.929576 -0.245347 -0.229291
C  0.453481 0.46325 -0.744774
C  -0.712251 2.885649 1.140687
C  -2.130437 -0.990499 -1.419645
C  -2.66393 -0.578476 0.93417
C  -3.058049 -2.053421 -1.451234
C  -3.59557 -1.640907 0.913432
C  2.669674 -0.335762 0.174379
C  -3.779167 -2.361399 -0.281134
C  3.379967 -0.519578 1.391025
C  3.284572 -0.664168 -1.062902
C  4.692484 -1.031365 1.373219
C  4.600406 -1.175442 -1.062143
C  5.311599 -1.363016 0.145011
H  -2.553012 2.184453 -1.039194
H  -1.110579 2.076894 -2.102126
H  -1.481713 4.273403 -0.337253
H  0.146449 3.636123 -0.675144
H  -1.551803 -0.749921 -2.317946
H  -2.505671 -0.010425 1.854691
H  0.987841 0.370679 1.213317
H  -3.212628 -2.630904 -2.3670
H  -4.164209 -1.900624 1.810976
H  2.904593 -0.263222 2.346385
H  2.734775 -0.517279 -1.994186
H  5.230518 -1.170169 2.317143
H  5.071781 -1.429206 -2.018135
H  6.331882 -1.760411 0.130956
