program: Gaussian 09
title: 000037031
version: EM64L-G09RevD.01
frameworkgroup: C1[X(C13H17NO)]
method: RPBEPBE
basis: SDD
operation: Freq
keyword: #p
keyword: freq=noraman
keyword: PBEPBE/SDD
title: #p freq=noraman PBEPBE/SDD
converged: YES YES NO NO
title: Mulliken charges:
elementType: O N C C C C C C C C C C C C C H H H H H H H H H H H H H H H H H
charge: -0.279356 -0.414526 -0.203568 -0.428523 -0.381796 -0.378593 0.329372 -0.584337 0.349263 -0.446219 -0.436383 -0.245231 -0.239175 0.242561 -0.777857 0.256713 0.248371 0.206869 0.199597 0.205945 0.201913 0.209761 0.193672 0.214018 0.310984 0.240645 0.232816 0.230333 0.229066 0.251169 0.253285 0.209212
chargesum: 0.00000
title: Mulliken charges with hydrogens summed into heavy atoms:
elementType: O N C C C C C C C C C C C C C
charge: -0.279356 -0.103542 0.053146 0.026717 0.023745 0.033082 0.329372 -0.176647 0.349263 -0.205574 -0.203567 -0.014897 -0.010110 0.242561 -0.064192
polarizability: 1.76598199e+02 -8.28202206e+00 1.39182918e+02 8.96653308e+00 1.37188534e+01 1.16225654e+02
1716.lowfreq: -6.4304 -0.0007 -0.0004 0.0003 9.7881 16.7815 30.5439 61.4268 74.4854
frequency: 30.2122 61.4205 74.4800 78.2843 107.9074 141.5431 185.5011 222.3354 262.8883 289.4414 307.3872 336.8949 367.6529 392.2824 440.1013 477.6117 504.4690 529.6371 548.5494 573.1188 596.5027 627.3794 662.6163 703.1974 755.4794 765.9616 787.7254 807.7801 856.4460 875.5559 891.3437 911.8551 946.7359 955.4750 965.4793 977.7126 990.7915 1018.7953 1039.6565 1041.1657 1067.2789 1092.6856 1107.7205 1129.2405 1146.9435 1175.3851 1183.0626 1210.0548 1219.0495 1244.0796 1246.8822 1263.5608 1284.1721 1315.3502 1329.5894 1345.3407 1351.6364 1362.4286 1373.9258 1382.7799 1385.2214 1436.7829 1449.5753 1456.3700 1459.4301 1460.7489 1467.4584 1470.7595 1478.7762 1490.2228 1586.3265 1610.1370 1611.3895 2958.4296 2968.6562 2974.9455 2983.6884 2993.9301 3001.3808 3022.9598 3029.4579 3036.2173 3051.4964 3095.2550 3097.8514 3115.9300 3121.8314 3139.3000 3161.2915 3557.6486
redmass: 4.5154 2.7931 1.3203 3.6948 2.7864 2.7920 5.3162 2.8299 2.8877 3.9544 2.9069 3.6987 2.2177 3.0283 1.9076 3.5601 1.3879 2.6619 3.1373 3.3967 2.6587 4.5505 3.1340 3.9551 2.5511 1.4896 2.1321 3.0695 2.3732 1.3756 2.0125 2.3568 2.1294 1.6528 3.5337 1.7114 1.3369 2.0154 1.6952 2.2637 1.9392 2.4483 1.9898 2.3760 1.5944 1.0914 1.4076 1.4882 1.6348 1.5891 1.3420 1.3053 1.5645 1.3816 1.3902 1.5259 1.3367 1.5985 1.6521 2.6489 1.2395 2.2681 1.0479 1.3421 1.1513 1.1010 1.1308 1.2122 1.4388 1.8542 6.5810 6.2907 6.2563 1.0648 1.0600 1.0631 1.0646 1.0360 1.0831 1.0984 1.0943 1.1012 1.1012 1.0998 1.0987 1.0864 1.0890 1.0930 1.1007 1.0782
irintensity: 5.1819 8.4428 0.1882 2.4591 0.6696 0.8535 7.6475 1.7860 0.5917 0.2073 0.2335 2.0752 0.5128 2.0706 3.6559 15.2057 56.9699 23.3520 17.3790 0.1936 1.7152 1.3188 1.2884 0.9201 18.6773 62.7273 3.9639 3.4427 2.3355 3.2059 2.7315 8.9596 11.1133 1.5521 1.4668 1.8541 0.0262 4.4945 14.9039 5.2002 1.8889 5.0698 5.0999 3.2643 6.5349 0.0973 3.1153 5.7529 1.4047 27.4890 4.0426 11.3314 12.2875 1.3646 0.4646 11.2012 1.1585 2.2826 1.9287 4.0310 63.3718 5.4684 15.1485 233.7308 36.0481 24.6719 17.0334 36.0639 83.9006 18.7390 4.2176 3.8001 189.6085 34.0250 23.5233 45.1938 11.3827 11.2294 23.0405 43.1296 53.9747 57.0304 35.2727 18.9355 12.0623 10.8650 2.6859 27.4177 30.6803 14.9903
temp: 298.150 k
press: 1.00000 atm
elementType: 8 7 6 6 6 6 6 6 6 6 6 6 6 6 6 1 1 1 1 1 1 1 1 1 1 1 1 1 1 1 1 1
symmnumber: 1
zpe: 715450.6 jmol-1
zpe.correction: 0.272501 hartree
zpe.thermalcorrener: 0.286521 hartree
zpe.thermalcorrenthalpy: 0.287466 hartree
zpe.thermalcorrgfe: 0.231008 hartree
zpe.sumelectzpe: -634.460473 hartree
zpe.sumelectthermal: -634.446452 hartree
zpe.sumelectthermalent: -634.445508 hartree
zpe.sumelectthermalfe: -634.501965 hartree
dipole: 2.5047 1.0805 2.8469
dipole: 3.9428
quadrupole: -95.6182 -86.5817 -88.4143
quadrupole: -4.2226 -8.1947 0.0023
quadrupole: -5.4135 3.6230 1.7905 -4.2226 -8.1947 0.0023
hfenergy: -634.7329734 hartree
pointgroup: C01 [X(C13H17N1O1)]
dipole: 0.9948861 0.4537267 1.1002823 debye
polarizability: 176.7994819|-7.8627987|139.7883462|8.555248|13.2514835|115.4189423 unknown
InChI: InChI=1S/C13H17NO/c1-10(15)14-13-9-5-3-7-11-6-2-4-8-12(11)13/h2,4,6,8,13-14H,3,5,7,9H2,1H3
charge 0 multiplicity 1
32 atoms
O  -3.41998 -0.95947 -0.782841
N  -1.550835 -0.41192 0.481788
C  -0.663847 -0.250778 -0.702693
C  -0.959525 1.06381 -1.486558
C  -0.951706 2.372354 -0.669826
C  0.412887 2.76362 -0.059372
C  0.797865 -0.4534 -0.296205
C  0.925987 1.782615 1.030124
C  1.527329 0.480907 0.503495
C  1.446366 -1.632767 -0.741841
C  2.880109 0.189873 0.817852
C  2.794303 -1.907149 -0.423238
C  3.517589 -0.985979 0.364246
C  -2.878146 -0.781682 0.353188
C  -3.647163 -0.965185 1.660259
H  -0.943331 -1.070811 -1.392241
H  -1.957116 0.938263 -1.947084
H  -0.223354 1.130992 -2.31236
H  -1.703462 2.295901 0.142203
H  -1.2959 3.1917 -1.331617
H  0.316276 3.767544 0.400334
H  1.174036 2.852006 -0.859971
H  0.083107 1.577901 1.723832
H  1.697256 2.295037 1.635233
H  -1.137151 -0.331703 1.411525
H  0.879025 -2.347715 -1.350047
H  3.444155 0.905515 1.428799
H  3.269873 -2.825559 -0.784156
H  4.564842 -1.178113 0.623045
H  -4.500164 -0.26484 1.6794
H  -4.064002 -1.986578 1.690179
H  -3.032819 -0.803387 2.563246
