program: Gaussian 09
title: 000037019
version: EM64L-G09RevD.01
frameworkgroup: C1[X(C11H8ClNO2)]
method: RPBEPBE
basis: SDD
operation: Freq
keyword: #p
keyword: freq=noraman
keyword: PBEPBE/SDD
title: #p freq=noraman PBEPBE/SDD
converged: YES YES NO NO
title: Mulliken charges:
elementType: Cl O O N C C C C C C C C C C C H H H H H H H H
charge: -0.039435 -0.232628 -0.165829 0.015243 0.187255 -0.495626 -0.546093 0.439845 0.192114 -0.365446 -0.387762 -0.207016 -0.205163 -0.202386 -0.115163 0.265585 0.265025 0.274146 0.280800 0.262798 0.256044 0.261478 0.262214
chargesum: 0.00000
title: Mulliken charges with hydrogens summed into heavy atoms:
elementType: Cl O O N C C C C C C C C C C C
charge: -0.039435 -0.232628 -0.165829 0.015243 0.187255 0.034983 0.008853 0.439845 0.192114 -0.102647 -0.131717 -0.207016 0.056316 0.059827 -0.115163
polarizability: 1.90881065e+02 -1.43020718e+00 1.33449501e+02 -2.32485765e-01 5.99633534e-01 7.57551957e+01
1716.lowfreq: -12.1306 -5.8390 0.0014 0.0022 0.0023 2.8540 20.1995 61.0528 63.5992
frequency: 20.1323 61.0487 63.5834 109.3937 120.5538 173.2859 207.5072 212.4975 244.7747 314.9842 344.7150 405.6477 409.6042 455.6375 463.8732 493.2385 504.5461 520.3935 569.4377 622.9742 643.1325 704.0004 716.9292 729.3576 783.1155 826.7074 832.4207 833.5932 925.6647 929.4663 954.4146 970.7634 989.5029 1002.6718 1016.0635 1070.3824 1075.7169 1082.9095 1117.2724 1171.9146 1190.4606 1209.3842 1242.8665 1287.6226 1297.7518 1302.7895 1370.9035 1394.8706 1444.5025 1468.8900 1477.8987 1586.2523 1601.4583 1727.5913 2194.4227 3019.9156 3036.8631 3103.5448 3114.7259 3143.9287 3154.1509 3174.1384 3177.7051
redmass: 4.2722 8.1976 9.1333 12.9751 3.5605 7.3430 2.8870 11.0914 10.1517 5.4839 6.2820 3.1680 5.0457 5.9033 7.6952 3.8960 4.6178 3.6016 4.5497 7.1413 5.7561 6.9202 3.7131 4.9947 2.7198 3.5988 1.4578 1.4047 4.9898 2.5667 1.4156 1.3727 2.5364 3.7095 3.0894 2.0391 2.7607 5.3962 1.3360 1.7140 1.1348 1.4800 3.0192 1.4218 1.2594 1.3821 6.6889 3.4107 1.0796 1.1015 2.3275 7.7018 6.1468 12.7415 12.6664 1.0654 1.0623 1.0988 1.1041 1.0900 1.0889 1.0957 1.0972
irintensity: 0.2239 0.9865 3.2995 2.4731 6.6515 1.8200 1.4230 1.7297 0.2303 2.3583 1.3747 3.1016 7.1820 1.9645 6.1834 16.2341 2.3221 12.0523 7.4482 1.7284 10.2894 7.9124 1.4746 11.7465 18.0734 129.9490 51.4881 24.2517 57.7565 26.4860 1.3967 0.1523 32.8158 21.2271 104.5296 7.3332 24.6934 219.4321 6.2559 10.0191 1.1043 0.6392 35.4175 9.9316 0.8478 9.1752 2.7203 11.2180 17.5106 14.8449 68.4270 3.6937 19.2429 367.9024 0.3885 4.3581 9.6742 3.0467 7.5075 2.3581 1.8992 2.4820 0.4590
temp: 298.150 k
press: 1.00000 atm
elementType: 17 8 8 7 6 6 6 6 6 6 6 6 6 6 6 1 1 1 1 1 1 1 1
symmnumber: 1
zpe: 427165.3 jmol-1
zpe.correction: 0.162699 hartree
zpe.thermalcorrener: 0.175808 hartree
zpe.thermalcorrenthalpy: 0.176752 hartree
zpe.thermalcorrgfe: 0.121170 hartree
zpe.sumelectzpe: -1088.153935 hartree
zpe.sumelectthermal: -1088.140825 hartree
zpe.sumelectthermalent: -1088.139881 hartree
zpe.sumelectthermalfe: -1088.195463 hartree
dipole: -0.9713 -0.2473 4.7391
dipole: 4.8439
quadrupole: -105.6612 -98.9684 -95.4126
quadrupole: 0.3952 13.8806 -0.6871
quadrupole: -5.6471 1.0456 4.6015 0.3952 13.8806 -0.6871
hfenergy: -1088.3166334 hartree
pointgroup: C01 [X(C11H8Cl1N1O2)]
dipole: -0.3340934 -0.717256 1.7337078 debye
dipolederiv: -0.8849008 -0.1474568 -0.0371289 -0.1585429 -0.1379549 -0.0263731 -0.0331867 -0.0248048 -0.0692914 -1.4738622 0.4873512 0.2021913 0.4458235 -0.574259 -0.0726251 -0.0390018 0.0313735 -0.4078842 -0.916832 0.3155228 0.2341086 0.4053227 -0.488782 -0.1820236 0.4217077 -0.2332191 -0.7069752 -0.1872207 -0.0137273 -0.0016669 0.0159106 -0.1822638 0.0048238 0.0013483 -0.0119038 -0.186 0.869749 0.0192921 -0.0526267 0.0429127 0.5848755 0.0098857 -0.4648371 0.1642214 0.509302 -0.0902674 -0.0462254 -0.0781685 -0.0045437 0.0262165 0.0320968 0.1276054 -0.0057469 0.004356 -0.0964007 0.0488936 -0.0453089 0.1206314 0.0875508 -0.0622801 -0.1327639 -0.0427563 -0.3657412 0.1055611 0.0494835 0.0454558 -0.0277907 -0.1547416 -0.001834 0.0447717 -0.0135604 -0.0991687 1.814202 -0.8155873 -0.3314081 -0.8516396 0.6200221 0.2922334 -0.023078 0.0984881 1.0136805 -0.011378 -0.0748509 -0.0393166 0.0971939 0.0210056 0.0372469 -0.0435959 0.0777269 -0.0789903 0.004473 0.0616529 0.0077409 -0.0959477 0.0298719 0.0508046 -0.0090703 0.0353819 -0.0978699 -0.1366511 0.0016571 0.0049532 -0.0189116 -0.0442522 -0.0167398 0.0350032 0.0292936 -0.1087399 -0.380958 0.0110902 0.0112665 0.0236889 0.0053403 0.0459908 0.0239043 0.0441077 -0.0759253 -0.3093462 -0.1431958 -0.0505674 -0.1781666 -0.0628546 0.0196846 -0.064829 0.0159318 -0.0852352 1.3033428 0.2352491 0.0476001 0.243196 0.1446883 0.0750366 0.0459609 0.0712003 -0.0358386 0.029625 -0.043323 0.0190496 -0.0966071 -0.0557961 0.0398243 0.0480755 0.0092686 0.0902913 0.0758557 0.0190564 0.0259275 0.0081875 0.0506249 -0.1000516 0.0271848 -0.0749579 -0.0204769 0.0264628 0.0605651 -0.0110376 0.0864234 0.0048998 0.0629542 -0.0075511 0.0337934 0.0901219 0.042339 -0.0537135 0.0258157 -0.0984042 0.0161009 -0.0223223 0.0160529 -0.0072805 0.0890118 0.042476 0.0701692 0.03015 0.0874293 0.0499855 -0.02963 0.0339676 -0.0372845 0.1290064 0.0880289 -0.0513163 -0.0191862 -0.0565865 -0.0039887 -0.0522551 -0.0258306 -0.0537026 0.1276422 0.0655049 -0.0474757 -0.0143013 -0.0457731 0.0116168 -0.0597572 -0.0085578 -0.0617758 0.1380795 0.0201969 0.0568891 0.0264578 0.056194 0.052094 -0.04469 0.0267199 -0.0437947 0.1466451 unknown
polarizability: 190.7799443|2.7911352|127.1533138|-2.0391553|18.0310112|82.1525031 unknown
InChI: InChI=1S/C11H8ClNO2/c12-9-3-1-8(2-4-9)11(7-13)6-5-10(14)15-11/h1-4H,5-6H2
charge 0 multiplicity 1
23 atoms
Cl -5.086187 -0.671892 -0.099486
O  1.642047 -0.094626 -0.954967
O  3.654178 -1.182177 -1.373054
N  1.573821 3.108101 0.310219
C  0.944938 0.508495 0.237661
C  1.61493 -0.220465 1.459751
C  3.046905 -0.500738 0.965687
C  -0.556361 0.259497 0.112656
C  2.895442 -0.663232 -0.549135
C  -1.005521 -0.99683 -0.364946
C  -1.502396 1.232481 0.511951
C  1.280093 1.953727 0.266062
C  -2.383909 -1.284527 -0.43567
C  -2.88619 0.953702 0.454317
C  -3.305686 -0.304143 -0.016505
H  1.067692 -1.161232 1.640533
H  1.567586 0.393566 2.372041
H  3.507343 -1.402537 1.39717
H  3.726531 0.350624 1.15697
H  -0.281477 -1.738379 -0.716741
H  -1.172455 2.216299 0.863237
H  -2.73483 -2.247781 -0.816081
H  -3.619193 1.704368 0.762232
