program: Gaussian 09
title: 000037016
version: EM64L-G09RevD.01
frameworkgroup: C1[X(C6H5N5O4S)]
method: RPBEPBE
basis: SDD
operation: Freq
keyword: #p
keyword: freq=noraman
keyword: PBEPBE/SDD
title: #p freq=noraman PBEPBE/SDD
converged: YES YES NO NO
title: Mulliken charges:
elementType: S O O O O N N N N N C C C C C C H H H H H
charge: 0.335329 -0.128758 -0.215219 -0.202702 -0.213183 -0.158358 -0.198167 0.019932 0.127007 0.090641 -0.379515 -0.409085 0.310059 -0.114960 -0.068119 -0.222760 0.275726 0.277197 0.284194 0.283820 0.306922
chargesum: 0.00000
title: Mulliken charges with hydrogens summed into heavy atoms:
elementType: S O O O O N N N N N C C C C C C
charge: 0.335329 -0.128758 -0.215219 -0.202702 -0.213183 -0.158358 -0.198167 0.019932 0.127007 0.090641 0.173408 0.158929 0.310059 -0.114960 -0.068119 0.084162
polarizability: 2.82360367e+02 -2.84068756e-01 1.35798963e+02 -1.59501107e-02 3.79219739e-01 5.55953010e+01
1716.lowfreq: -1.2003 -0.0012 -0.0006 0.0009 2.5776 8.9865 12.2144 35.6062 66.2511
frequency: 11.7174 35.6055 66.2364 80.4974 83.4874 95.0077 167.6776 180.0644 203.1280 213.0280 238.8115 313.6733 326.0224 347.6819 371.5878 429.9945 486.7220 490.1492 565.1807 598.6298 601.7901 663.6743 673.9650 688.5974 690.8814 721.1829 750.1765 807.3136 856.2662 890.2864 967.5456 1012.0627 1053.1295 1059.2943 1094.6422 1125.8976 1148.3768 1195.7574 1201.2839 1223.5447 1228.2244 1261.0718 1312.9842 1329.0077 1345.1972 1362.1838 1378.4523 1469.8747 1482.7781 1495.0103 1528.9158 1714.4705 3006.0335 3030.1381 3061.4737 3090.5532 3217.5304
redmass: 5.2224 10.3193 2.4481 11.0733 10.2667 10.8531 11.6854 9.3321 5.8894 12.7303 8.8509 10.5038 16.0958 6.3560 10.9311 10.4396 4.2302 8.1803 11.1338 11.6983 7.7947 9.0225 11.2845 6.8029 10.6028 11.5297 9.2237 6.1648 1.1887 1.4268 9.7546 3.1316 6.8560 9.7076 1.6383 3.4095 4.7181 1.1306 6.4793 6.1479 1.1177 2.0450 5.1106 2.1031 10.3587 2.5942 2.5418 6.7598 1.0824 1.0847 10.3454 12.8183 1.0582 1.0598 1.1079 1.1063 1.0965
irintensity: 3.8186 2.7563 0.1864 3.8406 1.2925 0.0061 0.5896 0.9231 4.9875 0.8622 5.5343 0.1780 1.6967 1.9957 5.4964 4.3886 6.4381 1.4586 3.9342 67.8299 5.3398 24.9066 11.8686 39.6903 16.6410 0.8064 80.6617 50.7812 1.5589 18.5808 3.4296 97.5260 652.1689 503.1286 2.1032 0.7566 150.1702 1.8230 509.7212 152.0981 1.7632 2.2001 38.1334 153.8454 114.8516 93.1770 13.2234 281.4273 42.0693 17.3202 496.0288 292.3088 8.0027 7.8420 3.2273 9.7948 6.0534
temp: 298.150 k
press: 1.00000 atm
elementType: 16 8 8 8 8 7 7 7 7 7 6 6 6 6 6 6 1 1 1 1 1
symmnumber: 1
zpe: 335220.4 jmol-1
zpe.correction: 0.127679 hartree
zpe.thermalcorrener: 0.142155 hartree
zpe.thermalcorrenthalpy: 0.143099 hartree
zpe.thermalcorrgfe: 0.083025 hartree
zpe.sumelectzpe: -1203.012184 hartree
zpe.sumelectthermal: -1202.997708 hartree
zpe.sumelectthermalent: -1202.996763 hartree
zpe.sumelectthermalfe: -1203.056838 hartree
dipole: -2.5137 -4.8649 0.1125
dipole: 5.4771
quadrupole: -144.4674 -101.5726 -94.1748
quadrupole: 17.8592 -0.1914 0.0563
quadrupole: -31.0625 11.8324 19.2301 17.8592 -0.1914 0.0563
hfenergy: -1203.1398627 hartree
pointgroup: C01 [X(C6H5N5O4S1)]
dipole: 1.0015339 1.9077946 0.0246362 debye
dipolederiv: -0.0501624 0.0816987 -0.0039104 0.3398737 -0.3204144 0.0186867 -0.0096917 0.0165691 0.1520209 -0.5471123 0.0068023 -0.0043879 0.3284304 -0.9665737 -0.0057753 -0.0052413 -0.0081821 -0.2712051 -1.3261981 0.0949135 -0.0038137 -0.9671241 -0.2220341 -0.0069395 -0.0264672 -0.0015856 -0.1622258 -1.0352625 -0.1774022 0.0003596 -0.4184637 -0.5395455 0.0074903 0.0075567 0.0093459 -0.2256098 -0.6957796 0.1340972 -0.007852 0.3795251 -0.6997904 0.0179946 -0.0164462 0.0164634 -0.2349502 -2.7777298 0.185565 -0.0132102 0.4673507 -0.6457639 0.0098853 -0.0092247 -0.0029865 -0.1797624 -2.1222246 -0.2866836 -0.0176576 0.1262544 -0.3478851 -0.0055316 -0.0072632 -0.0009638 -0.1311831 -1.1749874 -0.1246571 -0.0042841 -0.8215656 -0.6150748 0.0111146 0.0149588 0.0163118 -0.1773997 2.3610147 -0.0930255 0.011338 0.087232 0.0625745 0.0022728 0.0155133 0.0028574 -0.0209253 2.3874535 -0.1047337 0.0180128 -0.3022993 1.0446282 -0.0282145 0.0292027 -0.028176 0.2392017 0.1589964 0.0660496 -0.0043367 0.183259 0.383912 -0.0100367 -0.0122011 -0.0062762 0.2881015 0.0730493 0.0002532 -0.0012231 0.2353441 0.1837952 0.0085126 0.0169728 0.0015774 0.2896077 2.6510328 0.0023989 0.018655 -0.6651205 1.5376493 0.0104796 0.0217301 0.0128682 0.320449 2.1252566 -0.0679334 0.0157286 0.6678416 0.6957124 -0.0260484 -0.0011107 -0.0283727 0.0409012 -1.1125831 0.292426 -0.0177386 0.7804355 0.0345154 0.0026307 -0.0362028 -0.0012266 -0.085635 0.8918427 -0.0534079 0.0105186 -0.3438744 0.1841794 -0.00891 0.018189 -0.005553 0.0115828 0.0291277 0.0543443 0.0546295 -0.0152195 0.0136443 -0.0341821 0.0575019 -0.0488252 -0.0066339 0.0337957 0.0425263 -0.0529393 -0.0255264 0.0134173 0.0326411 -0.0545833 0.054944 -0.0239742 0.0157301 -0.0311174 0.0472842 -0.000582 0.0454474 0.0282402 0.0393104 0.0597689 0.0048737 0.0200684 -0.020182 -0.044617 0.0062611 0.0456974 -0.0265518 -0.0437331 -0.0612937 -0.0140398 0.0946718 -0.0019323 -0.0005558 -0.0420321 0.1119089 0.0022416 0.0012297 0.0027353 0.1868059 unknown
polarizability: 282.3400188|-1.2486543|135.7837276|1.5126906|-1.4874804|55.6308847 unknown
InChI: InChI=1S/C6H5N5O4S/c12-6-9(1-2-10(6)8-13)5-7-3-4(16-5)11(14)15/h3H,1-2H2
charge 0 multiplicity 1
21 atoms
S  -1.671972 1.253919 -0.059233
O  1.951225 -1.986626 -0.013645
O  5.380388 0.362606 0.026041
O  -5.135021 -0.762005 -0.016089
O  -4.646516 1.485784 -0.087076
N  0.919237 0.196225 0.002301
N  3.177396 0.073774 0.007143
N  -0.934875 -1.357677 0.039836
N  4.45396 -0.515265 0.002524
N  -4.306909 0.23298 -0.043267
C  1.375637 1.612033 -0.022394
C  2.925548 1.528564 0.040947
C  2.002595 -0.753063 -0.002582
C  -0.42365 -0.129158 0.001148
C  -2.903036 -0.071438 -0.023484
C  -2.317447 -1.333065 0.025409
H  0.960277 2.15872 0.842299
H  1.030114 2.102593 -0.949967
H  3.420464 2.018531 -0.813924
H  3.343481 1.962244 0.965293
H  -2.881696 -2.265476 0.053521
