program: Gaussian 09
title: 000037042
version: EM64L-G09RevD.01
frameworkgroup: C1[X(C23H33N2O2)]
method: RPBEPBE
basis: SDD
operation: Freq
keyword: #p
keyword: freq=noraman
keyword: PBEPBE/SDD
title: #p freq=noraman PBEPBE/SDD
converged: NO YES NO NO
title: Mulliken charges:
elementType: O O N N C C C C C C C C C C C C C C C C C C C C C C C H H H H H H H H H H H H H H H H H H H H H H H H H H H H H H H H H
charge: -0.411689 -0.408677 -0.164367 -0.222153 -0.172688 -0.208072 0.261199 -0.063433 -0.176598 -0.242645 -0.646230 -0.282306 -0.608469 -0.090540 -0.126339 -0.329064 0.255042 0.286686 -0.452561 -0.393338 -0.447164 -0.661771 -0.403507 -0.686548 -0.672235 -0.243726 -0.221243 0.311488 0.293565 0.275530 0.286293 0.257562 0.246540 0.299082 0.275159 0.231692 0.275990 0.280176 0.238546 0.296135 0.273283 0.216337 0.232353 0.338346 0.227958 0.223279 0.369157 0.270237 0.252241 0.235418 0.218787 0.241798 0.245849 0.221918 0.222306 0.245714 0.224623 0.221435 0.242376 0.241261
chargesum: 1.00000
title: Mulliken charges with hydrogens summed into heavy atoms:
elementType: O O N N C C C C C C C C C C C C C C C C C C C C C C C
charge: -0.073344 -0.039520 -0.164367 -0.222153 0.138799 0.085493 0.261199 0.212097 0.109696 0.014917 -0.100608 -0.007146 -0.100787 0.189636 0.112207 0.240354 0.255042 0.286686 -0.003870 0.057899 -0.176927 0.044675 -0.161709 0.003524 0.019538 -0.001350 0.020019
polarizability: 3.07225424e+02 4.23449370e-01 2.40832139e+02 -1.08311058e+01 1.58664600e+01 2.00550865e+02
1716.lowfreq: -9.1334 -0.0006 -0.0005 -0.0003 4.2907 12.8136 51.4620 56.8017 70.3104
frequency: 51.4480 56.6580 70.2958 76.8544 81.3762 106.7837 122.2407 126.9046 135.9339 157.2578 163.6220 172.0072 187.5905 207.6709 221.1271 233.9822 236.7980 256.6485 259.2993 274.8577 284.2042 288.9138 315.9189 318.7573 322.7418 327.3033 352.6008 379.0264 396.1647 411.2943 436.4467 449.2163 466.7995 486.3045 495.4350 526.7070 535.0003 556.4797 564.1713 591.0403 613.4252 623.8683 662.8238 674.5643 701.3744 739.2255 751.4577 757.9388 761.0687 767.3415 768.2470 794.3512 809.7385 829.2157 846.5358 866.1099 869.3596 882.9535 892.5882 905.3408 916.3898 922.7070 934.0421 946.8578 951.7906 951.9511 979.0312 986.6824 991.2384 995.3696 1014.7517 1021.1455 1025.5708 1028.8724 1033.5333 1042.5099 1056.6764 1067.4241 1070.7717 1077.8680 1090.6164 1106.9221 1112.9955 1118.6912 1123.1420 1127.5574 1129.8629 1146.8091 1153.9360 1166.6465 1177.9382 1183.0670 1186.0466 1195.1689 1200.7186 1221.2357 1228.7719 1240.2526 1248.6993 1255.7878 1263.7230 1272.6686 1276.9553 1285.7108 1290.8721 1295.6012 1296.7026 1303.1768 1312.0025 1314.4228 1321.9636 1323.1908 1325.4157 1327.1895 1333.5226 1341.0115 1349.5546 1359.4631 1369.7483 1378.8137 1387.0821 1389.0997 1404.5926 1405.1749 1407.9420 1438.6115 1452.6795 1464.0324 1470.0403 1473.8347 1476.8566 1478.9330 1481.1508 1481.5581 1484.2313 1486.6514 1487.5528 1498.5179 1504.4216 1599.3181 1619.3361 2867.8005 2936.1143 2948.0531 2981.7392 2987.7390 2992.0072 2995.4946 3004.2841 3013.5252 3014.5232 3029.4876 3039.3537 3046.9632 3053.2546 3060.4244 3063.8481 3065.5124 3068.8061 3070.5640 3077.5144 3080.8936 3082.9739 3093.1780 3093.4071 3100.3721 3101.1242 3116.2534 3140.8070 3151.0407 3160.6992 3175.8727 3548.4849 3573.4475
redmass: 3.6253 3.0324 2.8320 3.5622 3.9144 2.0164 3.4596 2.8611 3.4908 1.9674 2.3668 1.7015 4.4444 3.2194 1.2752 1.3743 1.6223 2.5719 1.6296 2.8649 2.0644 2.1845 2.5628 3.5807 3.4837 3.2183 2.7788 5.4942 3.2964 2.6816 2.3497 4.2655 3.5884 4.0482 3.7118 3.0934 4.5591 4.3343 3.9174 3.9513 4.1578 4.2139 4.1061 5.2784 3.5426 3.3149 3.0452 1.5882 1.4148 1.5553 3.6249 2.5894 3.2187 2.3673 2.9000 2.0403 1.4271 3.0078 2.8429 1.9371 1.8160 2.5168 1.9307 2.5459 2.7950 1.4666 2.7516 2.7527 1.3312 2.7026 2.5212 2.4967 2.6937 2.2478 2.9864 3.1147 2.2321 2.2945 2.5095 2.3944 2.1076 2.1131 1.7850 1.9474 1.7079 1.9889 1.7749 1.8474 1.3801 1.6249 1.1206 1.2562 1.5164 1.5461 1.8941 1.5112 1.5203 1.8016 2.0857 1.5504 1.4917 1.6009 1.4186 1.3525 1.5056 1.7711 1.4674 1.4104 1.2734 1.3390 1.2893 1.5256 1.4988 1.5060 1.5414 1.4140 1.4418 1.3535 1.2556 1.2055 1.2735 1.4855 2.1905 1.2015 1.2565 1.2930 1.9025 1.1892 1.8133 1.0512 1.0582 1.2267 1.0414 1.0649 1.0827 1.0927 1.0551 1.0848 1.0831 6.9748 7.2962 1.0817 1.0481 1.0839 1.0603 1.0370 1.0373 1.0595 1.0671 1.0664 1.0640 1.1013 1.0858 1.1010 1.0865 1.0863 1.0880 1.0877 1.0888 1.0897 1.0941 1.1002 1.1040 1.0990 1.1035 1.0988 1.0995 1.0938 1.0863 1.0900 1.0952 1.1003 1.0660 1.0669
irintensity: 0.0991 0.0308 0.4796 0.1641 0.1566 0.2992 0.9654 0.4747 4.3771 2.6842 1.9739 4.5846 13.3222 1.8360 19.5703 6.9532 49.6679 6.0933 23.2972 1.0445 101.1704 49.8790 5.8414 15.3287 4.4737 3.4335 4.8067 1.4970 8.7464 0.6964 1.1025 1.6004 11.0584 7.1290 1.0088 10.4641 5.2068 3.1512 3.8966 0.1394 7.6806 1.0937 8.8190 3.1020 3.6886 2.7935 8.7304 61.7114 4.2577 77.4286 42.3006 21.6576 20.5912 16.5076 18.1689 11.9835 2.3618 3.3092 1.4997 9.7672 27.2926 16.5451 8.2466 31.3038 8.0778 4.1884 67.3535 24.9733 0.0944 13.3779 24.3375 1.4620 18.3357 11.8081 23.3420 9.8216 11.4766 0.9973 8.5830 42.1114 38.3844 14.2178 10.6414 9.7693 14.1793 2.1205 8.6420 7.7566 11.0563 2.6886 9.7788 0.6782 6.7642 22.5389 28.0076 35.2558 3.0693 2.9716 20.4745 4.5938 0.1147 18.0575 10.0700 11.6601 2.1626 12.9249 7.9406 3.7123 0.5639 3.0016 2.0040 6.5903 2.5032 6.9620 1.7323 4.1202 1.1274 4.9467 17.7921 4.8240 22.9748 7.6106 12.2697 16.2067 12.7220 18.7964 22.0186 8.1121 46.8892 4.5191 8.1382 34.4869 16.8865 13.1626 18.2092 15.0494 14.0902 27.4198 17.2997 0.7347 34.3766 42.1853 68.1104 15.4428 19.8195 18.0041 13.9381 20.7246 30.9452 14.7465 5.6319 18.3864 4.4019 12.2943 28.2237 14.0889 5.7028 6.1839 13.4345 30.6994 8.7552 42.2325 18.9773 22.1062 20.9378 15.3974 19.3671 6.6006 1.6000 3.7204 11.2500 13.8996 10.1592 24.8917
temp: 298.150 k
press: 1.00000 atm
elementType: 8 8 7 7 6 6 6 6 6 6 6 6 6 6 6 6 6 6 6 6 6 6 6 6 6 6 6 1 1 1 1 1 1 1 1 1 1 1 1 1 1 1 1 1 1 1 1 1 1 1 1 1 1 1 1 1 1 1 1 1
symmnumber: 1
zpe: 1373434.7 jmol-1
zpe.correction: 0.523114 hartree
zpe.thermalcorrener: 0.547838 hartree
zpe.thermalcorrenthalpy: 0.548782 hartree
zpe.thermalcorrgfe: 0.471859 hartree
zpe.sumelectzpe: -1153.900697 hartree
zpe.sumelectthermal: -1153.875973 hartree
zpe.sumelectthermalent: -1153.875029 hartree
zpe.sumelectthermalfe: -1153.951951 hartree
dipole: -5.4167 2.6032 0.8963
dipole: 6.0762
quadrupole: -119.3273 -150.0695 -138.8928
quadrupole: 8.3443 -1.8694 2.8662
quadrupole: 16.7692 -13.9729 -2.7963 8.3443 -1.8694 2.8662
hfenergy: -1154.4238104 hartree
pointgroup: C01 [X(C23H33N2O2)]
dipole: 2.1716068 0.9368327 -0.3482798 debye
polarizability: 306.5947965|-3.2759981|242.3297626|-13.5914231|-13.3801105|199.6838692 unknown
InChI: InChI=1S/C23H33N2O2/c1-4-10-25-17-11-14(13(5-2)22(25)27)19-18(25)12-23(21(19)26)15-8-6-7-9-16(15)24(3)20(17)23/h6-9,13-14,17-22,26-27H,4-5,10-12H2,1-3H3
charge 1 multiplicity 1
60 atoms
O  -0.663127 -3.208518 0.827762
O  3.363971 1.786944 -1.175181
N  1.444968 0.849941 0.00471
N  -1.804988 1.23896 -0.83702
C  1.095108 -0.273334 1.016562
C  1.244413 -1.650591 0.269861
C  -1.055209 -0.81131 0.12233
C  0.680591 0.556345 -1.32585
C  2.155952 -1.466514 -0.977021
C  -0.802829 0.160431 -1.083681
C  -0.388938 -0.189455 1.387597
C  -0.232492 -2.116513 -0.047103
C  1.420391 -0.611658 -2.040223
C  3.01208 0.775198 -0.223277
C  3.439085 -0.678705 -0.587068
C  1.08196 2.277911 0.485732
C  -2.5710 -0.736447 0.201803
C  -2.952024 0.538406 -0.312988
C  4.32621 -1.316814 0.5145
C  1.529476 2.644981 1.911028
C  -3.525884 -1.593628 0.770927
C  -2.02004 2.227297 -1.911225
C  -4.291093 0.969195 -0.269161
C  4.86236 -2.712321 0.130975
C  1.086424 4.094317 2.22586
C  -4.880573 -1.171842 0.810261
C  -5.250127 0.095884 0.303585
H  1.783429 -0.149995 1.867532
H  1.699161 -2.392707 0.948884
H  0.743887 1.487087 -1.913335
H  2.424581 -2.449643 -1.397351
H  -1.105515 -0.382204 -2.014344
H  -0.588309 -0.808754 2.282435
H  -0.762778 0.819267 1.611095
H  -0.328754 -2.557943 -1.05218
H  2.141833 -0.232404 -2.787889
H  0.691414 -1.212622 -2.607467
H  3.426066 1.09453 0.746799
H  4.06781 -0.613532 -1.50204
H  -0.013385 2.36194 0.377001
H  1.563155 2.948539 -0.247329
H  3.769199 -1.383759 1.469782
H  5.181953 -0.639149 0.704587
H  -0.649859 -2.921438 1.776814
H  1.083595 1.962159 2.657573
H  2.628855 2.581028 2.016321
H  3.625104 1.39177 -2.044061
H  -3.237199 -2.580469 1.145236
H  -2.747828 2.98271 -1.574167
H  -2.403293 1.765051 -2.847393
H  -1.08221 2.763183 -2.138354
H  -4.60254 1.938247 -0.670867
H  5.551061 -3.088142 0.90683
H  4.05217 -3.455821 0.023177
H  5.422262 -2.679432 -0.822005
H  1.401353 4.38038 3.243407
H  1.537194 4.815453 1.520541
H  -0.012074 4.201175 2.171688
H  -5.645016 -1.833611 1.229093
H  -6.299487 0.407246 0.34109
