program: Gaussian 09
title: 000037057
version: EM64L-G09RevD.01
frameworkgroup: C1[X(C20H16N2O3)]
method: RPBEPBE
basis: SDD
operation: Freq
keyword: #p
keyword: freq=noraman
keyword: PBEPBE/SDD
title: #p freq=noraman PBEPBE/SDD
converged: YES YES NO NO
title: Mulliken charges:
elementType: O O O N N C C C C C C C C C C C C C C C C C C C C H H H H H H H H H H H H H H H H
charge: -0.521875 -0.261605 -0.324642 -0.519435 -0.497764 0.370631 -0.137867 0.415836 -0.430110 -0.389067 0.432404 -0.218815 0.123835 0.181283 0.236760 -0.433634 -0.383721 -0.340527 -0.344571 -0.198328 -0.217921 -0.253774 -0.225149 -0.243442 -0.227361 0.370802 0.276922 0.318209 0.409126 0.230102 0.244876 0.271822 0.274358 0.230003 0.227843 0.227566 0.230874 0.232989 0.228821 0.233073 0.401472
chargesum: 0.00000
title: Mulliken charges with hydrogens summed into heavy atoms:
elementType: O O O N N C C C C C C C C C C C C C C C C C C C C
charge: -0.120403 -0.261605 -0.324642 -0.148633 -0.088638 0.370631 -0.137867 0.415836 -0.153188 -0.070857 0.432404 0.011288 0.123835 0.181283 0.236760 -0.188758 -0.111899 -0.066169 -0.114568 0.029515 0.009645 -0.022900 0.007840 -0.014620 0.005711
polarizability: 4.95299195e+02 4.75993172e+00 2.40487704e+02 5.48446018e+00 3.51465324e+00 1.19729096e+02
1716.lowfreq: -3.3198 -0.0006 -0.0002 0.0004 1.3816 5.1784 20.0714 28.5189 35.0279
frequency: 20.0260 28.4616 34.8561 49.8105 58.6919 62.6136 93.8524 116.4775 123.4151 169.8686 188.7898 200.2864 222.8941 236.3501 268.3226 294.5763 324.9068 350.1614 356.1146 402.9752 408.7031 412.9147 424.4313 466.9280 484.4961 497.3847 520.7788 558.1551 561.9191 594.2633 605.6002 613.7727 614.8347 624.2079 676.1909 685.1364 689.8575 698.8308 702.4546 726.5726 746.8700 756.8026 787.5582 790.1651 802.8716 810.9687 838.7963 847.1408 851.2587 857.9056 874.1769 905.6167 924.5411 937.9335 970.5439 972.2258 984.7724 986.3244 988.0039 989.0323 1000.0615 1005.1051 1007.4362 1025.7823 1031.5543 1081.8917 1085.8285 1095.8091 1113.6187 1158.0266 1171.8900 1173.7551 1186.5823 1195.0106 1199.3743 1248.8612 1253.9472 1272.6874 1292.9784 1322.0060 1323.5545 1335.4130 1352.4730 1382.2292 1385.3029 1391.9218 1434.3944 1443.4551 1459.4472 1480.5984 1484.9555 1518.7290 1554.7981 1577.6333 1585.0417 1590.6975 1600.8786 1610.7749 1614.3240 1628.6710 1647.7159 3123.3374 3126.7051 3132.8294 3133.3696 3140.8901 3145.4502 3146.5212 3158.2252 3158.2914 3169.9222 3170.1009 3185.0490 3203.1716 3258.4485 3372.1285 3537.1201
redmass: 6.2422 4.0464 4.5781 5.9608 6.3023 5.7311 6.3005 7.5588 5.8721 5.0986 6.8427 5.1877 5.2400 5.5155 5.5571 5.4483 8.8006 8.4395 5.3974 2.8788 2.9737 7.1252 4.6970 3.4159 4.8420 3.2105 6.9041 1.2659 6.4622 4.6469 5.3869 6.3068 6.3653 4.9235 4.7753 4.5454 4.0939 2.6735 1.5162 4.0488 2.4562 2.2262 2.0669 2.2326 2.4149 1.6134 1.6531 1.4417 1.7164 1.2431 5.1554 1.4357 1.3685 1.4544 1.7410 3.0549 1.4809 4.8116 1.3147 5.8919 1.3179 1.5866 3.3551 2.2024 2.1586 1.6905 1.5954 1.8681 2.8941 1.6214 1.0511 1.0594 1.1162 1.1252 1.1992 2.2423 4.2999 2.6689 2.4763 1.4041 1.7460 2.4905 4.2413 4.6166 8.6865 3.9086 2.2609 2.3893 2.9006 2.2263 2.3662 2.9351 3.5419 4.8394 5.3650 5.4749 6.6852 6.1219 5.7573 2.2247 2.2121 1.0860 1.0852 1.0880 1.0879 1.0895 1.0927 1.0935 1.0958 1.0954 1.1005 1.1011 1.0937 1.0948 1.0798 1.0790 1.0643
irintensity: 0.1799 0.5061 0.5928 0.1447 2.4824 2.4946 0.4674 0.5152 0.7823 3.0579 1.5945 0.1733 1.9448 13.9410 2.3871 8.1322 3.1222 1.7443 3.9600 0.1657 0.8081 3.2941 9.1610 1.9768 3.9659 25.8310 13.6827 115.3470 10.2904 14.3401 5.1146 1.2044 1.7825 3.1319 42.5661 9.1318 13.6562 20.3114 81.5122 20.5069 22.6055 53.2012 29.9358 19.5279 86.0663 61.9710 7.9411 15.1959 70.7985 30.9649 34.2308 3.4397 9.8246 6.9951 12.2350 44.0553 7.9500 4.5655 1.9189 1.3925 4.5008 22.1806 125.6273 1.1398 5.5394 35.7463 26.4255 44.2506 5.5405 144.1304 0.3953 2.9902 7.9826 56.1267 24.4596 3.8970 50.3247 18.5033 343.2487 21.6731 434.3910 220.1342 23.3324 36.0450 1.7902 113.2420 11.0443 27.5765 642.0385 21.4849 43.1653 514.9212 234.1810 23.7660 145.1592 505.4433 142.7790 0.2375 41.5487 140.0240 172.8740 5.0338 9.2715 1.8194 2.4809 15.0427 22.4832 24.4759 19.0176 29.2133 32.7885 12.3464 3.7069 16.8117 149.4151 154.9165 74.5503
temp: 298.150 k
press: 1.00000 atm
elementType: 8 8 8 7 7 6 6 6 6 6 6 6 6 6 6 6 6 6 6 6 6 6 6 6 6 1 1 1 1 1 1 1 1 1 1 1 1 1 1 1 1
symmnumber: 1
zpe: 827105.0 jmol-1
zpe.correction: 0.315028 hartree
zpe.thermalcorrener: 0.335591 hartree
zpe.thermalcorrenthalpy: 0.336535 hartree
zpe.thermalcorrgfe: 0.263540 hartree
zpe.sumelectzpe: -1105.223387 hartree
zpe.sumelectthermal: -1105.202824 hartree
zpe.sumelectthermalent: -1105.201880 hartree
zpe.sumelectthermalfe: -1105.274874 hartree
dipole: 0.1955 -2.8148 0.3682
dipole: 2.8455
quadrupole: -117.5231 -139.5432 -147.8653
quadrupole: 17.0934 0.4114 1.4574
quadrupole: 17.4541 -4.5660 -12.8881 17.0934 0.4114 1.4574
hfenergy: -1105.5384149 hartree
pointgroup: C01 [X(C20H16N2O3)]
dipole: 0.0909104 1.1116314 -0.0965087 debye
polarizability: 495.16254|-7.7103216|240.1076538|-5.0265296|8.7964103|120.2458011 unknown
InChI: InChI=1S/C20H16N2O3/c23-19(14-8-3-1-4-9-14)22-17-13-7-12-16(18(17)20(24)25)21-15-10-5-2-6-11-15/h1-13,21-22,24H
charge 0 multiplicity 1
41 atoms
O  -0.999972 2.14031 0.158768
O  -3.187976 -2.273538 0.096031
O  1.236388 2.522243 0.466271
N  2.947843 0.572123 0.241575
N  -1.92689 -0.27463 0.055434
C  1.874849 -0.309988 0.168085
C  0.504979 0.202915 0.168283
C  -0.596797 -0.750475 0.082965
C  2.089922 -1.718314 0.134162
C  -0.331199 -2.137825 0.033057
C  4.328544 0.310053 0.01939
C  1.00271 -2.596864 0.072539
C  -3.119374 -1.007346 0.019054
C  0.328833 1.648301 0.276744
C  -4.368764 -0.168789 -0.105131
C  5.272325 1.06489 0.768904
C  4.799278 -0.595103 -0.971216
C  -5.591923 -0.770889 0.288628
C  -4.384205 1.152216 -0.627853
C  6.655278 0.907235 0.542552
C  6.185418 -0.754295 -1.181341
C  7.122699 -0.010648 -0.427035
C  -6.805043 -0.06052 0.186143
C  -5.601532 1.859595 -0.737378
C  -6.813633 1.259333 -0.324769
H  2.678796 1.552022 0.447375
H  3.107428 -2.106771 0.204471
H  -1.169799 -2.832127 -0.009493
H  -2.011422 0.751197 0.087255
H  1.189182 -3.676586 0.066493
H  4.91285 1.765025 1.531903
H  4.087973 -1.140422 -1.598546
H  -5.562649 -1.799395 0.662644
H  -3.463463 1.626397 -0.987774
H  7.368278 1.496062 1.130273
H  6.532695 -1.451713 -1.952009
H  8.196887 -0.137661 -0.59753
H  -7.742108 -0.533319 0.499629
H  -5.606337 2.872959 -1.153821
H  -7.756439 1.811031 -0.409628
H  -0.96933 3.125815 0.280393
