program: Gaussian 09
title: 000037026
version: EM64L-G09RevD.01
frameworkgroup: C1[X(C16H15NO3)]
method: RPBEPBE
basis: SDD
operation: Freq
keyword: #p
keyword: freq=noraman
keyword: PBEPBE/SDD
title: #p freq=noraman PBEPBE/SDD
converged: YES YES NO NO
title: Mulliken charges:
elementType: O O O N C C C C C C C C C C C C C C C C H H H H H H H H H H H H H H H
charge: -0.265773 -0.428470 -0.215960 -0.419463 -0.286925 0.436947 -0.650195 0.214560 0.416044 -0.385299 -0.362029 0.182417 -0.400202 -0.385005 -0.229078 -0.226198 -0.238508 -0.222119 -0.222463 -0.238383 0.304242 0.372218 0.251155 0.247132 0.248201 0.256162 0.240104 0.241267 0.225686 0.228702 0.229988 0.229674 0.230340 0.231757 0.389474
chargesum: 0.00000
title: Mulliken charges with hydrogens summed into heavy atoms:
elementType: O O O N C C C C C C C C C C C C C C C C
charge: -0.265773 -0.038997 -0.215960 -0.047245 0.017317 0.436947 -0.151908 0.214560 0.416044 -0.137098 -0.105868 0.182417 -0.160098 -0.143738 -0.003392 0.002505 -0.008520 0.007556 0.007877 -0.006626
polarizability: 1.98901788e+02 -1.98992165e+00 1.87561968e+02 -2.26434610e+01 -6.77934953e+00 1.47288295e+02
1716.lowfreq: -12.1481 -6.7306 -3.9808 -2.1930 -0.0004 -0.0002 0.0008 15.4338 22.7351
frequency: -8.6883 14.0080 22.5228 34.7504 41.1494 52.9236 66.9877 92.6550 123.1490 203.2105 206.9674 253.2755 280.9653 318.4785 324.7940 369.2839 401.4901 402.3600 429.9649 472.1608 487.5483 533.8102 563.4364 579.8269 606.1936 614.1838 617.3324 625.6262 649.9864 654.9836 691.2823 704.4036 706.3381 747.9159 764.2734 828.8133 838.0394 847.9768 854.1141 858.5445 916.6906 923.7431 928.6794 937.8712 978.6142 980.9831 989.5948 989.9233 996.9692 998.4908 1026.7634 1027.1064 1075.3810 1079.7607 1081.1674 1118.7214 1171.3524 1173.7104 1175.9463 1183.8360 1189.0102 1191.8528 1210.8655 1226.8664 1241.2631 1285.0284 1296.7212 1297.7604 1327.2529 1335.4211 1380.3111 1386.7643 1438.6166 1439.4941 1449.6079 1480.9045 1483.7035 1484.1628 1590.5613 1595.8759 1607.9951 1610.7974 1617.8387 1669.6971 3007.1568 3026.9087 3067.1955 3118.3435 3119.4351 3125.2128 3132.1785 3135.5468 3143.1639 3147.0373 3152.6527 3165.4504 3166.2336 3525.3520 3528.9617
redmass: 4.7811 4.0810 3.8434 6.9007 6.2973 9.1552 4.9634 6.3796 5.8750 5.0297 5.1201 5.8791 6.0607 2.2756 4.9134 6.8532 2.8349 2.8304 5.2859 3.4146 3.3568 3.4647 2.2710 3.6759 4.4877 6.2844 6.2662 2.2282 1.3652 2.8918 4.2665 2.0046 1.7746 1.8344 1.9717 3.7522 4.2471 3.7908 1.2815 1.2667 1.9206 1.7705 1.4971 3.2435 1.3989 1.3853 6.2100 6.0010 1.3143 1.3122 2.2437 2.2746 1.9202 2.1517 1.6064 2.9911 1.1444 1.0580 1.1579 1.9396 1.1491 1.3230 2.1121 2.2904 1.3958 1.6037 2.0820 1.4333 1.2718 1.2967 8.1200 7.0340 2.1796 2.1680 1.1258 2.1937 2.2384 1.9601 6.0332 6.2678 6.8302 6.1207 7.0642 9.4625 1.0621 1.0831 1.0987 1.0877 1.0873 1.0846 1.0878 1.0907 1.0922 1.0958 1.0962 1.1014 1.1016 1.0644 1.0779
irintensity: 0.0614 0.1972 0.1054 2.9776 2.5305 0.6499 5.1958 0.7655 0.6586 0.4136 4.0935 2.5832 0.2482 1.1816 1.3958 2.3354 0.2640 0.0296 7.8972 1.0132 20.7495 57.5356 70.1051 34.3823 24.3132 1.7832 0.8061 62.8484 73.9805 32.5322 21.8240 35.3823 64.9081 26.5382 50.7970 5.8733 7.3950 13.7006 0.1058 0.5111 2.8072 3.9773 2.1327 44.0383 0.3610 0.0317 0.1011 0.5676 0.2676 0.2939 5.5818 7.5800 107.1678 67.7985 8.8558 1.6906 2.4725 0.6152 2.0676 13.1959 0.2439 0.5182 14.5647 44.1762 7.9460 36.3487 34.5932 12.0550 0.2750 9.5590 0.3687 0.9840 6.7912 7.0256 64.2754 14.6736 53.7287 257.8234 5.1897 14.1195 133.2123 26.9887 105.6309 226.2879 12.1464 11.7438 3.3087 6.2094 6.0150 0.4856 1.9581 7.6901 13.5939 33.6578 28.7350 20.1280 22.0976 27.4824 60.3406
temp: 298.150 k
press: 1.00000 atm
elementType: 8 8 8 7 6 6 6 6 6 6 6 6 6 6 6 6 6 6 6 6 1 1 1 1 1 1 1 1 1 1 1 1 1 1 1
symmnumber: 1
zpe: 718000.0 jmol-1
zpe.correction: 0.273472 hartree
zpe.thermalcorrener: 0.290587 hartree
zpe.thermalcorrenthalpy: 0.291532 hartree
zpe.thermalcorrgfe: 0.224753 hartree
zpe.sumelectzpe: -897.726675 hartree
zpe.sumelectthermal: -897.709559 hartree
zpe.sumelectthermalent: -897.708615 hartree
zpe.sumelectthermalfe: -897.775394 hartree
dipole: 2.5823 1.9363 -3.7738
dipole: 4.9657
quadrupole: -110.1252 -109.7069 -121.6740
quadrupole: -7.9874 -3.1608 5.0978
quadrupole: 3.7102 4.1284 -7.8386 -7.9874 -3.1608 5.0978
hfenergy: -898.0001467 hartree
pointgroup: C01 [X(C16H15N1O3)]
dipole: 1.012441 1.0187346 -1.3243821 debye
polarizability: 190.3859846|6.8642282|183.5010708|-28.4137408|13.6993945|159.8649951 unknown
InChI: InChI=1S/C16H15NO3/c18-14(11-12-7-3-1-4-8-12)17-15(16(19)20)13-9-5-2-6-10-13/h1-10,15,17,19H,11H2
charge 0 multiplicity 1
35 atoms
O  -0.105884 -2.208217 2.018231
O  -1.164255 -0.700764 -2.389938
O  -3.269797 -1.373895 -1.667777
N  -0.081887 -1.017418 0.020221
C  -1.529816 -0.819957 0.007133
C  -1.993022 0.563028 0.524586
C  2.066149 -1.896457 0.914674
C  0.535993 -1.715307 1.043308
C  2.773383 -0.982729 -0.071638
C  -1.076821 1.62399 0.705777
C  -3.364998 0.766895 0.815117
C  -2.105252 -1.020061 -1.399733
C  3.074705 -1.417968 -1.388436
C  3.131147 0.340527 0.302472
C  -1.527658 2.879523 1.174171
C  -3.813789 2.021097 1.282283
C  -2.896031 3.082673 1.462718
C  3.716191 -0.556494 -2.308474
C  3.772088 1.203737 -0.613432
C  4.065957 0.758181 -1.924028
H  -1.969404 -1.597719 0.659212
H  0.467294 -0.669474 -0.76978
H  2.462442 -1.765833 1.937178
H  2.228731 -2.959485 0.653611
H  -0.013434 1.467202 0.49538
H  -4.07896 -0.052276 0.67059
H  2.814421 -2.439891 -1.691283
H  2.914345 0.688501 1.320348
H  -0.810319 3.695872 1.315243
H  -4.875536 2.168249 1.508884
H  -3.24383 4.055608 1.827415
H  3.94652 -0.912454 -3.318897
H  4.047189 2.218832 -0.305626
H  4.56614 1.425827 -2.634175
H  -1.579302 -0.786945 -3.289835
