program: Gaussian 09
title: 000037030
version: EM64L-G09RevD.01
frameworkgroup: C1[X(C16H25NO)]
method: RPBEPBE
basis: SDD
operation: Freq
keyword: #p
keyword: freq=noraman
keyword: PBEPBE/SDD
title: #p freq=noraman PBEPBE/SDD
converged: YES YES NO NO
title: Mulliken charges:
elementType: O N C C C C C C C C C C C C C C C C H H H H H H H H H H H H H H H H H H H H H H H H H
charge: -0.462511 -0.075706 0.203457 -0.505774 -0.451654 0.202381 -0.396298 -0.380980 0.340301 -0.591643 -0.395951 -0.390934 -0.356212 -0.445005 -0.259191 -0.244537 -0.626131 -0.616603 0.194359 0.225471 0.214430 0.196080 0.201075 0.206880 0.206303 0.203214 0.212110 0.207075 0.214904 0.247088 0.163158 0.208090 0.275749 0.333432 0.229915 0.226862 0.225976 0.236667 0.180443 0.217082 0.225337 0.219404 0.181886
chargesum: 0.00000
title: Mulliken charges with hydrogens summed into heavy atoms:
elementType: O N C C C C C C C C C C C C C C C C
charge: -0.129078 -0.075706 0.203457 -0.085944 -0.041143 0.202381 0.011657 0.028537 0.340301 -0.172457 0.066042 -0.115185 0.015036 -0.215090 -0.032329 -0.018561 0.008060 0.010024
polarizability: 1.73974676e+02 -6.88550330e+00 1.94425529e+02 1.38333875e+01 4.71944418e+00 1.60949737e+02
1716.lowfreq: -21.0047 -12.8557 -10.6959 -0.0004 0.0003 0.0008 28.4939 30.1013 42.6745
frequency: 26.3740 29.9296 42.4271 83.6478 100.2998 106.2944 118.5021 145.3971 187.2895 213.9598 235.8494 242.8505 254.0840 291.1929 301.1087 312.2555 323.9393 339.3767 354.3625 366.1255 382.0489 407.5796 442.4896 455.5990 483.5108 494.7740 526.9504 545.2823 586.7220 590.3841 673.9834 749.9973 754.9120 767.3188 773.4043 796.1340 817.0834 826.6244 851.0080 869.6804 891.6041 914.8395 959.1619 962.5718 969.8793 985.9375 997.7815 1022.6462 1031.0883 1035.4912 1056.9976 1066.8453 1075.1801 1082.6606 1088.6112 1095.4163 1106.6417 1122.8670 1135.2942 1141.8468 1158.3683 1174.6479 1177.3768 1210.0139 1217.5171 1226.3149 1240.1125 1257.3777 1263.1150 1278.9924 1286.0864 1290.7937 1300.5783 1318.6565 1329.4773 1345.4681 1349.8409 1357.4773 1360.9405 1372.0216 1373.9513 1417.3353 1429.5177 1439.1672 1447.8566 1457.9954 1460.0351 1462.3624 1463.6542 1467.7264 1473.1623 1473.6232 1476.1887 1481.1205 1482.6358 1488.8254 1581.5853 1605.8703 2797.9012 2832.6263 2849.7605 2952.6238 2966.0453 2969.0331 2977.1024 2980.8004 2995.7619 3008.1063 3014.4416 3021.4725 3023.5442 3027.6600 3027.9193 3037.0537 3040.7539 3074.1598 3081.5447 3088.7120 3112.3064 3128.8760 3149.5353 3164.8666 3532.4670
redmass: 3.4334 2.8107 4.0869 3.0336 3.4290 1.8308 2.8618 3.2034 2.6750 2.8070 1.1779 1.5077 1.6477 3.5173 3.4073 2.9070 2.9218 2.5729 2.4571 1.4733 2.0933 2.4130 2.3268 2.6244 3.6389 2.4862 3.3301 2.4667 3.3219 4.0542 4.7697 1.3744 2.7107 1.5041 2.4351 2.1155 2.8782 2.4257 1.6527 1.4444 1.5009 2.2937 2.4402 1.4859 2.7602 2.1238 1.3434 2.3880 1.7759 2.1996 2.8725 2.1478 2.0818 1.8153 1.8386 1.6224 1.7917 2.2946 1.3874 1.3772 1.5921 1.0776 1.4747 2.0295 1.5706 1.6741 1.3649 1.4940 1.9804 1.3529 1.2762 1.3952 1.2583 1.5685 1.5075 1.5025 1.3986 1.5061 1.6308 1.4871 3.0301 1.1425 2.0775 1.1688 1.1348 1.0952 1.0704 1.0502 1.2217 1.1301 1.2127 1.1539 1.0747 1.2136 1.1850 1.0813 6.6318 6.2759 1.0703 1.0580 1.0580 1.0629 1.0634 1.0606 1.0623 1.0609 1.0784 1.0685 1.0708 1.0977 1.0998 1.0931 1.0734 1.1006 1.0986 1.1010 1.1017 1.0999 1.0868 1.0887 1.0944 1.0974 1.0656
irintensity: 0.1288 0.3749 0.0860 0.3760 0.6907 0.6317 1.5289 0.7126 0.4078 0.2917 1.7312 0.0887 1.6508 5.2119 1.4012 4.5807 3.4803 10.8013 1.6837 54.5301 58.7149 25.8144 3.2958 14.2730 0.8330 4.9279 2.6243 2.0787 5.4362 3.8856 4.8650 2.1224 10.7701 51.3109 20.4185 2.5957 34.4360 1.4230 4.1910 4.2675 0.2051 18.1178 15.4216 3.3434 7.1844 20.0855 1.2857 18.5471 26.3767 2.7631 13.9149 4.2357 7.0655 2.2452 23.6349 5.0371 8.9761 2.1129 9.4600 9.4920 7.8571 0.6434 1.9230 2.5268 5.6540 0.1368 11.2102 3.8568 7.3029 10.5407 1.5659 17.5633 13.2996 27.7695 3.6900 2.0544 1.5163 11.2367 1.9319 13.6022 3.4408 2.3469 6.2705 3.2397 1.6221 9.1960 4.7640 18.0735 14.5077 3.7599 30.5555 3.0293 11.0164 4.4172 19.5897 15.8566 0.1948 0.4859 78.6473 73.1748 227.0930 31.3063 24.3829 22.8893 24.4274 41.1261 5.6726 43.7350 50.4998 57.2090 25.4931 63.9407 26.7489 60.4847 40.8428 30.2581 39.5782 44.5636 8.9547 14.9958 22.9103 22.9146 7.2526
temp: 298.150 k
press: 1.00000 atm
elementType: 8 7 6 6 6 6 6 6 6 6 6 6 6 6 6 6 6 6 1 1 1 1 1 1 1 1 1 1 1 1 1 1 1 1 1 1 1 1 1 1 1 1 1
symmnumber: 1
zpe: 989712.3 jmol-1
zpe.correction: 0.376962 hartree
zpe.thermalcorrener: 0.395513 hartree
zpe.thermalcorrenthalpy: 0.396458 hartree
zpe.thermalcorrgfe: 0.329964 hartree
zpe.sumelectzpe: -753.250729 hartree
zpe.sumelectthermal: -753.232177 hartree
zpe.sumelectthermalent: -753.231233 hartree
zpe.sumelectthermalfe: -753.297727 hartree
dipole: -1.6681 -0.7912 -1.5867
dipole: 2.4343
quadrupole: -108.5410 -105.0080 -109.0212
quadrupole: 0.5148 -4.1849 0.9434
quadrupole: -1.0176 2.5154 -1.4978 0.5148 -4.1849 0.9434
hfenergy: -753.6276904 hartree
pointgroup: C01 [X(C16H25N1O1)]
dipole: -0.6738368 0.2840257 0.6185072 debye
polarizability: 174.6094453|7.1724212|194.0734277|-13.2370534|6.1317498|160.6670694 unknown
InChI: InChI=1S/C16H25NO/c1-17(2)13-7-12-16(18)11-6-5-9-14-8-3-4-10-15(14)16/h3-4,8,10,18H,5-7,9,11-13H2,1-2H3
charge 0 multiplicity 1
43 atoms
O  -0.194886 0.905021 -2.364169
N  4.242523 -0.156975 0.202764
C  -0.633606 0.960826 -0.938326
C  -1.68209 2.116366 -0.877617
C  0.67157 1.318749 -0.17937
C  -1.212731 -0.414711 -0.516745
C  -2.106713 2.663886 0.502925
C  -2.900624 1.675737 1.382052
C  -1.888493 -0.638389 0.725873
C  -2.089357 0.424319 1.8051
C  1.811041 0.290191 -0.346713
C  -1.040148 -1.510657 -1.402271
C  3.086369 0.754505 0.384934
C  -2.389853 -1.938575 1.000197
C  -1.544921 -2.796434 -1.111609
C  -2.235072 -3.01343 0.098744
C  4.058062 -1.470973 0.850302
C  5.511115 0.476551 0.615924
H  -2.590194 1.781494 -1.424199
H  -1.240429 2.946519 -1.463573
H  1.004523 2.305866 -0.558772
H  0.445404 1.445303 0.895938
H  -2.725034 3.567302 0.330231
H  -1.211273 3.007346 1.058785
H  -3.821462 1.356445 0.854178
H  -3.226697 2.20576 2.299327
H  -2.604837 -0.054341 2.658915
H  -1.108574 0.763173 2.197711
H  1.475042 -0.689199 0.042511
H  2.037937 0.156875 -1.418538
H  2.854409 0.907146 1.475668
H  3.381829 1.744151 -0.017114
H  -0.478034 -1.343572 -2.325716
H  -1.005867 0.824326 -2.931011
H  -2.912543 -2.107117 1.950148
H  -1.392671 -3.617325 -1.821453
H  -2.638962 -4.002049 0.344377
H  3.172913 -1.982721 0.437683
H  3.930667 -1.397837 1.962499
H  4.938921 -2.106811 0.648859
H  5.661876 1.412815 0.049074
H  6.355836 -0.199227 0.389728
H  5.553133 0.723871 1.709053
