program: Gaussian 09
title: 000037115
version: EM64L-G09RevD.01
frameworkgroup: C1[X(C11H28O4Si4)]
method: RPBEPBE
basis: SDD
operation: Freq
keyword: #p
keyword: freq=noraman
keyword: PBEPBE/SDD
title: #p freq=noraman PBEPBE/SDD
converged: YES YES NO NO
title: Mulliken charges:
elementType: Si Si Si Si O O O O C C C C C C C C C C C H H H H H H H H H H H H H H H H H H H H H H H H H H H H
charge: 1.644639 1.635062 1.633549 1.638985 -0.994871 -0.988297 -0.980938 -0.986384 -0.844938 -0.841304 -0.381184 -0.383199 -0.346997 -1.051105 -1.055308 -1.053066 -1.050107 -1.056124 -1.051716 0.230662 0.238830 0.241581 0.230625 0.207559 0.207882 0.207673 0.207708 0.195162 0.184161 0.237566 0.239593 0.250514 0.239907 0.244416 0.240339 0.244726 0.240202 0.240486 0.250396 0.238372 0.239800 0.239169 0.246727 0.240789 0.239100 0.239176 0.250180
chargesum: 0.00000
title: Mulliken charges with hydrogens summed into heavy atoms:
elementType: Si Si Si Si O O O O C C C C C C C C C C C
charge: 1.644639 1.635062 1.633549 1.638985 -0.994871 -0.988297 -0.980938 -0.986384 -0.375446 -0.369097 0.034257 0.032182 0.032325 -0.323432 -0.330646 -0.327651 -0.321538 -0.329439 -0.323261
polarizability: 2.27814471e+02 -2.94803465e+00 2.07289596e+02 -2.11144757e+00 4.94655922e-01 2.00603297e+02
1716.lowfreq: -6.5444 -0.0022 -0.0012 -0.0012 1.7554 7.7945 8.5514 17.3807 24.6818
frequency: 7.5876 16.7258 24.6279 27.6158 29.0173 44.8947 73.9008 113.2154 121.8374 123.5325 124.6168 128.4238 142.0661 145.5287 146.8743 153.2922 154.8622 165.2819 168.0261 171.1681 173.1579 189.3298 200.3078 213.8804 220.4056 237.5038 245.1122 270.6831 300.6866 309.6115 324.5457 332.1649 340.9314 353.7296 369.3104 379.6123 437.4447 452.8358 469.0606 511.9552 586.4836 635.1973 668.4175 671.4139 675.3127 698.3605 715.2081 715.9525 717.0326 787.4711 793.0078 796.9974 809.8877 810.4860 810.9668 836.9810 838.3401 853.5311 870.9804 874.8808 890.3579 902.9639 903.4938 917.9336 921.8872 924.3992 926.7263 977.5130 1011.8394 1029.1609 1041.6892 1044.0595 1045.2510 1048.3690 1096.2023 1121.4839 1188.1590 1209.5455 1251.7001 1273.4345 1291.2973 1303.0000 1303.6214 1305.0761 1308.3190 1309.2578 1311.7987 1331.2651 1340.1809 1340.7108 1426.9773 1429.1409 1439.0955 1439.3357 1439.6023 1440.3184 1441.8787 1442.0785 1447.0351 1447.5668 1448.9253 1450.6720 1452.7762 1453.0184 1464.9168 1466.7147 1477.3146 2960.4686 2966.0727 2966.9656 2983.2923 2985.8580 2987.6757 2988.6124 2988.9882 2992.1522 2992.2604 2992.6367 3019.2701 3021.4647 3029.7860 3051.3060 3054.6654 3094.1387 3095.0900 3095.1534 3095.5101 3095.7580 3096.3155 3098.1561 3098.6134 3098.8554 3100.9941 3101.2519 3101.7155
redmass: 3.5373 3.7550 3.6558 4.2958 3.5446 3.6832 4.6452 2.7486 3.5987 1.0379 1.0764 1.0318 1.0564 1.5802 1.5332 1.3818 1.6355 2.4358 2.7497 2.5387 2.6327 2.6915 2.9290 3.1237 4.0580 3.2703 3.0599 4.8277 4.8307 4.4405 3.9074 2.0602 7.1575 5.1810 3.6239 10.1637 4.9145 2.0657 4.7487 3.4178 4.4311 4.0618 1.9182 3.6973 4.0316 3.8741 2.2541 2.2371 2.1808 2.9255 2.5477 1.5570 1.2443 1.2498 1.2484 1.9262 1.9562 2.0832 1.3628 1.4539 1.4248 1.5309 1.5744 2.0340 1.6396 2.1617 1.7752 11.2008 1.5224 1.9858 8.5814 1.1567 8.4860 11.0195 2.6077 1.0764 1.4535 1.5453 1.2349 1.3585 1.1812 1.2185 1.2195 1.2176 1.2043 1.2039 1.2033 1.3503 1.3983 1.4145 1.0870 1.0810 1.0515 1.0516 1.0529 1.0511 1.0535 1.0534 1.0487 1.0487 1.0481 1.0468 1.0468 1.0466 1.0867 1.0823 1.0817 1.0610 1.0627 1.0598 1.0617 1.0615 1.0345 1.0345 1.0345 1.0344 1.0344 1.0344 1.1008 1.0953 1.1023 1.1005 1.1003 1.0983 1.0984 1.0985 1.0985 1.0984 1.0984 1.0983 1.0980 1.0980 1.0983 1.0984 1.0984
irintensity: 0.0619 0.0528 0.8627 0.7982 1.8017 0.1001 0.0228 0.3609 0.5219 0.0215 0.0334 0.0019 0.0029 0.4956 0.2868 0.1034 0.1931 0.2217 0.2311 0.0180 0.2536 1.1292 0.2822 0.8225 0.5327 0.3700 0.9739 8.4152 13.7596 27.0041 60.0302 28.5496 108.0161 128.9910 1.3307 6.9379 2.7882 0.7808 10.2199 21.4027 16.2598 9.4802 7.1707 29.6576 14.8063 0.9832 2.2458 4.4594 23.7550 55.5942 0.3175 48.2110 0.0160 0.1581 0.0793 10.1801 29.4632 303.8386 13.4076 64.6539 175.1317 143.1737 77.9910 28.3935 1.4915 4.6846 3.0511 0.3033 32.0802 75.0295 180.7475 83.7353 1195.0147 1147.5092 0.3942 0.4500 28.6091 23.3791 0.0386 3.3869 12.3095 9.3557 10.1541 150.2871 60.1059 56.5239 22.7156 0.0239 0.6824 0.9086 13.8044 7.4458 1.8304 0.8612 0.7113 8.4161 0.3455 1.5910 7.2876 13.4555 2.3111 2.0977 22.8902 13.5492 13.0657 6.2030 8.6772 29.0612 45.5906 34.4398 17.4115 15.8092 14.6990 5.9183 9.0554 7.7382 10.0986 7.2332 46.8674 80.4654 51.3562 22.3518 46.5794 5.1473 18.7499 7.5877 0.0780 8.3563 15.7641 19.8488 41.4527 31.0484 12.8143 16.7958 16.2251
temp: 298.150 k
press: 1.00000 atm
elementType: 14 14 14 14 8 8 8 8 6 6 6 6 6 6 6 6 6 6 6 1 1 1 1 1 1 1 1 1 1 1 1 1 1 1 1 1 1 1 1 1 1 1 1 1 1 1 1
symmnumber: 1
zpe: 1000158.0 jmol-1
zpe.correction: 0.380940 hartree
zpe.thermalcorrener: 0.409499 hartree
zpe.thermalcorrenthalpy: 0.410443 hartree
zpe.thermalcorrgfe: 0.318748 hartree
zpe.sumelectzpe: -1893.240529 hartree
zpe.sumelectthermal: -1893.211971 hartree
zpe.sumelectthermalent: -1893.211026 hartree
zpe.sumelectthermalfe: -1893.302721 hartree
dipole: 0.1154 -0.0077 0.0399
dipole: 0.1223
quadrupole: -140.5159 -141.3851 -143.4232
quadrupole: -0.3686 0.4530 -0.1993
quadrupole: 1.2588 0.3896 -1.6484 -0.3686 0.4530 -0.1993
hfenergy: -1893.6214692 hartree
pointgroup: C01 [X(C11H28O4Si4)]
dipole: 0.0455584 -0.0046382 0.014761 debye
polarizability: 227.5011537|-3.6014369|207.5025307|-2.6446931|0.6739812|200.7036795 unknown
InChI: InChI=1S/C11H28O4Si4/c1-16(2)12-17(3,4)14-19(10-8-7-9-11-19)15-18(5,6)13-16/h7-11H2,1-6H3
charge 0 multiplicity 1
47 atoms
Si 1.514205 0.482917 -0.204131
Si -0.380064 -2.216265 0.349249
Si -1.26864 2.273337 0.222429
Si -2.951924 -0.432169 -0.789846
O  0.843667 -1.058139 0.093143
O  0.313077 1.672569 0.001381
O  -1.852337 -1.633041 -0.282496
O  -2.393784 1.093769 -0.273338
C  2.243447 0.509489 -1.958125
C  2.972543 0.745032 0.981695
C  3.555293 -0.33211 -1.993834
C  4.184543 -0.125956 0.530997
C  4.61053 0.111772 -0.943725
C  0.082046 -3.788569 -0.596071
C  -0.584397 -2.478069 2.216502
C  -1.533879 2.61568 2.067922
C  -1.472359 3.800106 -0.876258
C  -3.023701 -0.448047 -2.684068
C  -4.619768 -0.757533 0.042018
H  2.462798 1.560791 -2.232893
H  1.51428 0.126658 -2.697374
H  2.682028 0.502766 2.021356
H  3.253113 1.817277 0.964131
H  4.003631 -0.272249 -3.005483
H  3.307974 -1.400033 -1.821669
H  3.931644 -1.198378 0.660699
H  5.048651 0.075374 1.194937
H  5.552999 -0.439177 -1.133962
H  4.838969 1.188842 -1.089252
H  1.042547 -4.198969 -0.236507
H  -0.696083 -4.56304 -0.473849
H  0.182042 -3.569141 -1.673464
H  0.355493 -2.841443 2.669485
H  -0.858438 -1.528154 2.709709
H  -1.380052 -3.215357 2.426328
H  -1.407117 1.687819 2.653895
H  -0.805386 3.35846 2.43958
H  -2.551923 3.002357 2.25421
H  -1.308531 3.531575 -1.934603
H  -2.488096 4.223704 -0.780943
H  -0.740963 4.581233 -0.602083
H  -3.710658 0.331627 -3.05937
H  -2.02175 -0.257224 -3.108135
H  -3.372332 -1.428157 -3.056104
H  -5.360141 0.009379 -0.247771
H  -5.015907 -1.74943 -0.239663
H  -4.50829 -0.730085 1.140154
