program: Gaussian 09
title: 000036979
version: EM64L-G09RevD.01
frameworkgroup: C1[X(C10H14O2)]
method: RPBEPBE
basis: SDD
operation: Freq
keyword: #pfreq=noraman
keyword: PBEPBE/SDD
title: #p freq=noraman PBEPBE/SDD
converged: YES YES NO NO
title: Mulliken charges:
elementType: O O C C C C C C C C C C H H H H H H H H H H H H H H
charge: -0.290714 -0.426846 0.188944 0.380148 -0.017032 0.379494 -0.007942 -0.591402 -0.870699 -0.831567 -0.796165 -0.520398 0.238337 0.227777 0.284675 0.228519 0.253352 0.226117 0.220287 0.236314 0.211875 0.238750 0.366138 0.231637 0.216404 0.223999
chargesum: 0.00000
title: Mulliken charges with hydrogens summed into heavy atoms:
elementType: O O C C C C C C C C C C
charge: -0.290714 -0.060708 0.188944 0.380148 -0.017032 0.379494 -0.007942 -0.353065 -0.129728 -0.131811 -0.109227 0.151641
polarizability: 1.46936261e+02 1.15577727e+00 1.32951493e+02 1.36198244e+00 -6.06360943e-01 6.82542825e+01
1716.lowfreq: -13.4746 -0.0006 -0.0006 -0.0003 2.5881 9.3446 71.1418 88.7838 103.3085
frequency: 71.1277 88.7816 103.2990 119.0716 130.6628 154.2160 163.5671 169.7339 218.1544 265.8297 280.3185 301.8962 315.1518 327.3806 333.5010 397.7548 446.5798 473.8123 522.6843 562.2899 587.5358 651.3801 677.5347 756.2951 799.9162 881.8405 934.7760 953.0746 1011.0255 1018.5468 1028.2582 1040.0471 1043.6539 1050.3294 1080.8913 1112.2547 1151.0732 1177.0331 1211.2644 1259.3269 1341.3075 1377.0895 1386.7030 1392.9586 1401.6667 1404.6116 1428.4732 1449.0169 1456.8789 1457.1009 1468.7555 1470.0881 1477.4929 1483.8076 1491.4890 1493.5155 1612.2014 1616.7697 2952.2303 2955.7134 2968.1517 2980.9842 3019.2752 3041.5122 3050.9338 3058.4620 3088.4880 3091.5128 3100.6101 3107.8619 3119.0086 3575.0730
redmass: 2.6243 2.7984 1.0320 1.0695 3.1731 1.0892 1.2733 1.9478 3.0272 2.6041 2.6498 1.6249 3.4848 2.7793 3.6947 4.3127 5.2615 5.7998 3.1894 4.2421 3.2479 5.8020 5.6257 4.4142 3.1093 1.3022 2.6960 5.1661 1.8727 1.7705 1.5769 1.4816 1.4912 1.5385 4.2995 1.2455 1.4089 1.7757 2.9195 1.5587 6.2085 4.5223 1.2757 1.3242 1.2776 2.2310 1.7986 1.3579 1.0536 1.0497 1.0738 1.0655 1.1525 1.2745 1.2480 1.1186 7.0122 6.7046 1.0397 1.0323 1.0414 1.0364 1.0980 1.1031 1.0914 1.0969 1.1002 1.0998 1.0931 1.1009 1.0913 1.0653
irintensity: 4.5834 1.0091 0.1219 0.3624 0.1994 0.4183 1.6571 3.4950 7.7108 4.0351 4.4116 81.5898 1.8497 27.1345 21.6425 6.0793 2.5830 4.0172 1.0936 0.2414 7.4005 3.6293 4.3689 2.2177 4.4219 10.8951 9.2089 29.1767 9.8016 40.9027 8.0695 2.3051 0.9814 11.2992 200.3530 0.6383 14.1577 107.9594 50.0431 8.0388 8.7952 5.2413 29.6020 3.4795 12.9376 2.6378 23.8399 14.4738 6.9065 13.9124 15.6976 7.8351 5.2056 37.9241 57.5483 18.5343 10.0379 6.0454 41.8612 65.6667 47.4822 34.0153 24.5416 51.0719 21.9975 19.3930 18.4788 12.1288 4.8779 30.3720 18.4325 27.7245
temp: 298.150 k
press: 1.00000 atm
elementType: 8 8 6 6 6 6 6 6 6 6 6 6 1 1 1 1 1 1 1 1 1 1 1 1 1 1
symmnumber: 1
zpe: 563391.0 jmol-1
zpe.correction: 0.214584 hartree
zpe.thermalcorrener: 0.228343 hartree
zpe.thermalcorrenthalpy: 0.229288 hartree
zpe.thermalcorrgfe: 0.175153 hartree
zpe.sumelectzpe: -538.982774 hartree
zpe.sumelectthermal: -538.969015 hartree
zpe.sumelectthermalent: -538.968071 hartree
zpe.sumelectthermalfe: -539.022206 hartree
dipole: -1.1849 0.8726 1.4257
dipole: 2.0489
quadrupole: -71.3123 -61.8794 -75.0014
quadrupole: 0.3192 -4.9262 0.4326
quadrupole: -1.9146 7.5183 -5.6037 0.3192 -4.9262 0.4326
hfenergy: -539.1973583 hartree
pointgroup: C01 [X(C10H14O2)]
dipole: -0.4727051 -0.3369093 -0.5593314 debye
dipolederiv: -1.2503122 -0.1575531 -0.2202712 -0.1423629 -0.4496242 -0.0524747 -0.1334085 -0.0264835 -0.3939456 -0.7575237 0.6005684 -0.0203002 0.6265608 -0.7546531 -0.0318448 0.0097497 -0.044394 -0.3879581 -0.2814525 0.1885888 -0.0290432 0.0435409 0.0561186 -0.0318814 -0.0052583 -0.0284966 -0.0756831 -0.0936701 -0.1478564 -0.0287298 -0.2923675 -0.0125769 0.0162158 0.0515804 -0.0112419 -0.0577648 0.9223654 0.1052814 0.1010317 0.2888269 0.2998128 0.0356396 -0.1127504 -0.0190604 -0.0691412 0.2243359 0.0516753 -0.0247387 0.3033097 -0.1543838 -0.0196956 -0.0465295 0.0074275 -0.0336568 0.5070464 -0.5839027 -0.009131 -0.6500077 0.6093875 0.0284373 -0.0244899 0.0167716 0.0073143 0.0131055 0.0450961 -0.0196578 -0.0110938 0.0413927 -0.0195072 -0.0276498 -0.0178615 -0.1913452 -0.0455095 -0.0042226 0.0249893 -0.0368555 -0.0883009 0.0202803 0.0274783 0.0138512 0.1070243 -0.0336111 0.0495914 0.0286088 0.0671183 -0.0210865 -0.0049111 0.0020444 0.046026 0.089219 -0.1331362 -0.0160636 0.0176657 0.0297766 0.1146626 -0.0016291 0.0224611 0.0011025 0.066843 0.5380325 0.0319803 0.168264 -0.0175146 0.2868011 0.0401496 0.3887865 0.0816214 0.445128 0.0609118 -0.052583 0.0084068 -0.057371 -0.1101768 0.0104136 0.0113568 0.0072658 0.1433782 0.0299522 0.0860624 -0.1218427 0.0190026 -0.0320723 0.0619915 -0.0808482 0.0966874 -0.0250837 -0.0377224 -0.1028318 0.0330706 -0.0117019 0.1430747 -0.017453 0.0186495 0.0038152 0.1088417 0.0926342 0.0418257 0.0573403 -0.0006619 -0.058496 -0.0626694 0.0377585 -0.121226 -0.0649119 -0.0469229 0.0118834 0.0801118 -0.0497739 0.0883971 0.0625527 0.0967855 0.0096903 0.0455262 0.0432916 -0.1031892 -0.0559585 -0.0120174 -0.0985558 -0.0828049 -0.0126958 -0.0969768 0.0680724 0.0046108 0.0982968 -0.0655657 0.0768284 0.0399438 0.0237802 -0.119303 0.0786874 -0.1021855 -0.0029889 -0.009424 0.0630945 0.0157848 0.0671516 -0.0878485 0.119084 -0.0462972 -0.058042 0.0665985 0.0229196 0.0030495 -0.0936388 -0.1604584 0.0141992 0.0054755 0.0043861 0.101343 -0.0366853 -0.0033382 -0.069534 0.0280312 0.074872 0.0761095 -0.1237374 0.0408253 -0.0235843 0.2915133 -0.1535295 0.0187444 -0.1346136 0.1943051 0.020201 0.0061121 0.0311568 0.3358478 -0.1677655 -0.0766723 0.0140098 -0.0852573 0.0847651 0.0072875 0.0400962 0.0186151 0.0620565 0.0300085 0.0873529 0.0644297 0.0251971 -0.044817 -0.1304004 -0.0619263 -0.1169776 -0.0795295 0.0628938 -0.0099562 -0.018044 0.0712604 -0.1154828 0.1258625 -0.0888213 0.0710857 -0.0177627 unknown
polarizability: 146.8707009|-1.5680557|133.0044526|-0.9067936|-1.4162844|68.2668833 unknown
InChI: InChI=1S/C10H14O2/c1-6-5-7(2)10(12-4)8(3)9(6)11/h5,11H,1-4H3
charge 0 multiplicity 1
26 atoms
O  -2.351186 -0.491602 0.384729
O  2.401762 -1.630809 -0.077156
C  -0.001786 -1.101017 0.130367
C  -0.677095 1.291318 0.096936
C  -0.997434 -0.089075 0.177799
C  1.721406 0.674657 -0.121158
C  1.348193 -0.689774 -0.020329
C  0.68934 1.636449 -0.051358
C  -0.356593 -2.5706 0.261716
C  -1.75295 2.358002 0.192768
C  3.177238 1.059209 -0.279277
C  -3.157564 -0.543039 -0.847129
H  0.961408 2.697951 -0.107894
H  0.179446 -3.051895 1.105366
H  -1.433626 -2.674557 0.465586
H  -0.126961 -3.14378 -0.65956
H  -2.599865 2.004286 0.805249
H  -1.35208 3.280764 0.647257
H  -2.153825 2.633348 -0.80325
H  3.606531 0.628365 -1.202833
H  3.295337 2.155635 -0.316932
H  3.786611 0.66754 0.555836
H  2.050013 -2.549919 0.025891
H  -4.164576 -0.861712 -0.534878
H  -2.736372 -1.273961 -1.565944
H  -3.214471 0.449814 -1.3335
